program: Orca
programVersion: 5.0.3
elementType: C H C H C C C H H C H H C C H H H H H H H
charge: 1
multiplicity: 1
keywords: b3lyp cc-pVTZ EnGrad RIJCOSX verytightscf cc-pVTZ/C def2/J soscf
formula: C8H13
InChI: InChI=1/C8H13/c1-2-4-6-8-7-5-3-1/h1-2,7H,3-6,8H2
21 atoms
C  -1.993404 0.603596 0.083962
H  -2.171306 0.772838 1.152428
C  -1.815345 -0.95462 -0.172091
H  -2.646606 -1.474059 0.31352
C  -0.43384 -1.318501 0.357347
C  0.655401 -1.245669 -0.432319
C  1.95231 -0.700648 0.071934
H  2.125386 -0.942651 1.125605
H  2.819561 -1.034548 -0.507901
C  1.819062 0.84633 -0.105991
H  1.858983 1.104574 -1.170345
H  2.648171 1.365491 0.382961
C  0.474541 1.406079 0.508592
C  -0.698092 1.190346 -0.324504
H  0.523862 -1.251838 -1.516823
H  -1.872763 -1.149399 -1.247766
H  0.321928 1.06235 1.534149
H  -0.606561 1.513009 -1.366677
H  -2.828964 0.991391 -0.507084
H  0.619142 2.506734 0.52605
H  -0.316254 -1.364367 1.440921
totalener: -312.22510243 hartree
nucrepener: 380.02021901 hartree
electener: -692.24532144 hartree
oneelecener: -1161.07277676 hartree
twoeener: 468.82745531 hartree
kineticenergy: 309.97214210 hartree
exchangeener: -36.299944718664 hartree
correlationener: -2.303934508789 hartree
xcener: -38.603879227454 hartree
chargesum: 1.0000000
charge: -0.165522 0.153110 -0.173996 0.152903 -0.107345 -0.115999 -0.172029 0.133307 0.150952 -0.187062 0.131546 0.153592 -0.163150 0.068618 0.154193 0.141186 0.141419 0.206205 0.161396 0.183078 0.153597
charge: 0.099412 0.009516 0.102764 -0.001445 0.085564 0.064086 0.076442 -0.002960 0.004678 0.118036 -0.009161 -0.001523 0.078980 0.341526 -0.017099 -0.001533 0.003447 0.015260 0.008352 0.043952 -0.018294
qa: -0.1655 0.1531 -0.1740 0.1529 -0.1073 -0.1160 -0.1720 0.1333 0.1510 -0.1871 0.1315 0.1536 -0.1632 0.0686 0.1542 0.1412 0.1414 0.2062 0.1614 0.1831 0.1536
va: 3.8100 0.9866 3.8553 0.9806 3.7945 3.8052 3.8618 0.9924 0.9831 3.8278 0.9895 0.9798 3.8559 3.5217 0.9891 0.9897 0.9958 0.9692 0.9828 0.9739 0.9937
energy: -312.225102433511
dipole: 0.44462 -0.89814 -0.45352 1.96555 -0.87091 1.09464 0.14883 -0.27044 -0.12160
magnitude: 1.19110 au
magnitude: 3.02753 debye
