program: Orca
programVersion: 5.0.3
elementType: C H C H C C C H H C H H C C H H H H H H H
charge: 1
multiplicity: 1
keywords: DSD-PBEP86 cc-pVTZ EnGrad D3BJ RIJCOSX verytightscf cc-pVTZ/C def2/J soscf
formula: C8H13
InChI: InChI=1/C8H13/c1-2-4-6-8-7-5-3-1/h1-2,7H,3-6,8H2
21 atoms
C  -1.989877 0.568099 0.099874
H  -2.166297 0.749085 1.16538
C  -1.860284 -0.969373 -0.174461
H  -2.660134 -1.518588 0.329438
C  -0.459964 -1.273075 0.333337
C  0.638794 -1.214945 -0.458033
C  1.930479 -0.686771 0.072617
H  2.077843 -0.945965 1.126291
H  2.799183 -1.037349 -0.494116
C  1.838028 0.866011 -0.085633
H  1.893797 1.130156 -1.148282
H  2.682343 1.35371 0.409874
C  0.506549 1.447677 0.511249
C  -0.649356 1.093641 -0.311965
H  0.529211 -1.292174 -1.540712
H  -1.929303 -1.166154 -1.24923
H  0.366758 1.18061 1.562028
H  -0.534625 1.303635 -1.379935
H  -2.797854 1.016853 -0.488902
H  0.616548 2.548419 0.449715
H  -0.32815 -1.274555 1.416789
totalener: -311.12979137 hartree
nucrepener: 381.20114468 hartree
electener: -692.33093605 hartree
oneelecener: -1162.76003488 hartree
twoeener: 470.42909882 hartree
kineticenergy: 309.72391376 hartree
exchangeener: -13.665158407946 hartree
correlationener: -0.922490074041 hartree
xcener: -14.587648481987 hartree
chargesum: 1.0000000
charge: -0.226055 0.177144 -0.227357 0.181780 -0.119319 -0.141603 -0.240194 0.163781 0.180151 -0.245070 0.156904 0.181928 -0.232329 0.032942 0.204335 0.165835 0.172274 0.229127 0.186079 0.209769 0.189877
charge: 0.089264 0.005781 0.091916 -0.000239 0.103173 0.083620 0.072054 -0.001307 0.005507 0.107437 -0.007431 -0.000466 0.070105 0.335978 -0.011905 0.000061 0.003405 0.014049 0.008733 0.039737 -0.009471
qa: -0.2261 0.1771 -0.2274 0.1818 -0.1193 -0.1416 -0.2402 0.1638 0.1802 -0.2451 0.1569 0.1819 -0.2323 0.0329 0.2043 0.1658 0.1723 0.2291 0.1861 0.2098 0.1899
va: 3.8583 0.9808 3.8985 0.9748 3.8317 3.8402 3.9113 0.9853 0.9768 3.8838 0.9831 0.9722 3.9094 3.5870 0.9706 0.9858 0.9842 0.9579 0.9758 0.9653 0.9800
dispcorr: -0.011935478 hartree
energy: -311.832345379612
dipole: 0.51473 -0.90020 -0.38547 1.91691 -1.08043 0.83649 0.14818 -0.28130 -0.13312
magnitude: 0.93060 au
magnitude: 2.36539 debye
