program: Orca
programVersion: 5.0.3
elementType: C H C H C C C H H C H H C C H H H H H H H
charge: 1
multiplicity: 1
keywords: PBE0 cc-pVTZ EnGrad D3BJ RIJCOSX verytightscf cc-pVTZ/C def2/J soscf
formula: C8H13
InChI: InChI=1/C8H13/c1-3-7-5-2-6-8(4-1)9-7/h3,6-8H,1-2,4-5H2
21 atoms
C  -1.991489 0.666107 0.108018
H  -2.177215 0.857683 1.169354
C  -1.831927 -0.936056 -0.129131
H  -2.645607 -1.437143 0.398212
C  -0.458382 -1.337146 0.390294
C  0.684622 -1.269182 -0.370592
C  1.993751 -0.665785 0.096619
H  2.183903 -0.867242 1.155348
H  2.848597 -1.011249 -0.487549
C  1.833603 0.936029 -0.127359
H  1.925612 1.158561 -1.19518
H  2.645725 1.436381 0.403155
C  0.458114 1.326783 0.397785
C  -0.68806 1.278683 -0.360054
H  0.543449 -1.253497 -1.455015
H  -1.926389 -1.148787 -1.198705
H  0.001982 -0.000369 0.091094
H  -0.553799 1.284588 -1.445293
H  -2.850876 1.012313 -0.46897
H  0.347706 1.331269 1.485248
H  -0.346249 -1.361922 1.47723
totalener: -312.01710933 hartree
nucrepener: 382.87457729 hartree
electener: -694.89168662 hartree
oneelecener: -1166.22589517 hartree
twoeener: 471.33420855 hartree
kineticenergy: 309.60497350 hartree
exchangeener: -34.146531558537 hartree
correlationener: -1.976922323594 hartree
xcener: -36.123453882130 hartree
chargesum: 1.0000000
charge: -0.195472 0.150189 -0.200830 0.159119 -0.050440 -0.034052 -0.194872 0.149798 0.159560 -0.200376 0.148422 0.158978 -0.050789 -0.034095 0.159441 0.148727 0.082832 0.160155 0.159627 0.161712 0.162365
charge: 0.108819 -0.002031 0.112309 0.002483 0.130964 0.146200 0.108851 -0.002122 0.003071 0.112331 -0.002623 0.002371 0.129745 0.147473 0.003947 -0.002555 -0.014340 0.003447 0.003141 0.004537 0.003981
qa: -0.1955 0.1502 -0.2008 0.1591 -0.0504 -0.0341 -0.1949 0.1498 0.1596 -0.2004 0.1484 0.1590 -0.0508 -0.0341 0.1594 0.1487 0.0828 0.1602 0.1596 0.1617 0.1624
va: 3.8769 0.9902 3.8861 0.9862 3.7920 3.7933 3.8768 0.9904 0.9857 3.8863 0.9911 0.9863 3.7931 3.7926 0.9949 0.9910 1.1481 0.9944 0.9857 0.9954 0.9950
dispcorr: -0.019043896 hartree
energy: -312.036153226194
dipole: -0.00292 -0.00215 -0.00507 0.00124 -0.00175 -0.00050 -0.06616 0.05298 -0.01318
magnitude: 0.01413 au
magnitude: 0.03591 debye
