program: Orca
programVersion: 5.0.3
elementType: C H C H C C C H H C H H C C H H H H H H H
charge: 1
multiplicity: 1
keywords: PBE0 cc-pVTZ EnGrad D3BJ RIJCOSX verytightscf cc-pVTZ/C def2/J soscf
formula: C8H13
InChI: InChI=1/C8H13/c1-2-4-6-8-7-5-3-1/h1-2,7H,3-6,8H2
21 atoms
C  -1.993003 0.545699 0.115152
H  -2.168523 0.732446 1.178585
C  -1.909109 -0.983232 -0.174414
H  -2.670269 -1.558202 0.357624
C  -0.489338 -1.211074 0.304973
C  0.6238 -1.171245 -0.484271
C  1.915378 -0.669621 0.070581
H  2.03591 -0.949963 1.122388
H  2.780686 -1.040673 -0.486593
C  1.863805 0.889914 -0.059588
H  1.949831 1.166496 -1.117255
H  2.715393 1.340605 0.457539
C  0.535694 1.47469 0.503349
C  -0.596552 0.960252 -0.290319
H  0.533351 -1.30881 -1.561703
H  -2.00011 -1.181728 -1.246916
H  0.406888 1.290395 1.574126
H  -0.461574 1.053248 -1.371374
H  -2.760456 1.059646 -0.474684
H  0.578394 2.569593 0.35817
H  -0.346186 -1.174433 1.386565
totalener: -312.07079979 hartree
nucrepener: 383.17464239 hartree
electener: -695.24544218 hartree
oneelecener: -1167.26662584 hartree
twoeener: 472.02118366 hartree
kineticenergy: 309.64147130 hartree
exchangeener: -34.160096358130 hartree
correlationener: -1.968359447421 hartree
xcener: -36.128455805550 hartree
chargesum: 1.0000000
charge: -0.160330 0.147852 -0.165362 0.154035 -0.073856 -0.097441 -0.178604 0.140635 0.155258 -0.199325 0.138139 0.153590 -0.166218 -0.020784 0.188976 0.143104 0.146290 0.191651 0.157151 0.177740 0.167498
charge: 0.088430 0.002692 0.092316 0.000046 0.119924 0.119018 0.075698 0.001325 0.007389 0.100542 -0.004855 0.000687 0.065914 0.283709 -0.005477 0.001399 0.002781 0.007212 0.006676 0.034480 0.000096
qa: -0.1603 0.1479 -0.1654 0.1540 -0.0739 -0.0974 -0.1786 0.1406 0.1553 -0.1993 0.1381 0.1536 -0.1662 -0.0208 0.1890 0.1431 0.1463 0.1917 0.1572 0.1777 0.1675
va: 3.8478 0.9933 3.8717 0.9876 3.8118 3.8152 3.8954 0.9936 0.9879 3.8718 0.9897 0.9853 3.8789 3.6740 0.9796 0.9956 0.9924 0.9798 0.9863 0.9789 0.9923
dispcorr: -0.018860871 hartree
energy: -312.089660664969
dipole: 0.55602 -0.80640 -0.25038 1.87088 -1.41766 0.45322 0.16520 -0.29398 -0.12879
magnitude: 0.53356 au
magnitude: 1.35620 debye
