program: Orca
programVersion: 5.0.3
elementType: C H C H C C C H H C H H C C H H H H H H H
charge: 1
multiplicity: 1
keywords: DSD-PBEP86 cc-pVTZ EnGrad D3BJ RIJCOSX verytightscf cc-pVTZ/C def2/J soscf
formula: C8H13
InChI: InChI=1/C8H13/c1-2-4-6-8-7-5-3-1/h1-2,7H,3-6,8H2
21 atoms
C  -1.997337 0.757331 0.071798
H  -2.167639 0.84189 1.14797
C  -1.733191 -0.958497 -0.154131
H  -2.618429 -1.316644 0.375989
C  -0.420172 -1.383194 0.395913
C  0.688589 -1.279648 -0.373114
C  2.003315 -0.689343 0.063908
H  2.213385 -0.882647 1.121545
H  2.856885 -1.0320 -0.526581
C  1.791758 0.869113 -0.143279
H  1.83982 1.124452 -1.20731
H  2.596901 1.413803 0.356302
C  0.42177 1.254446 0.479802
C  -0.76655 1.307345 -0.378189
H  0.52484 -1.208354 -1.453094
H  -1.837481 -1.123369 -1.226995
H  0.168956 0.487078 1.224729
H  -0.655465 1.541149 -1.441054
H  -2.879794 0.986557 -0.524294
H  0.442005 2.149562 1.126315
H  -0.340147 -1.49567 1.477219
totalener: -311.09338214 hartree
nucrepener: 379.77163764 hartree
electener: -690.86501978 hartree
oneelecener: -1159.91974162 hartree
twoeener: 469.05472184 hartree
kineticenergy: 309.72402517 hartree
exchangeener: -13.661484149570 hartree
correlationener: -0.921782278666 hartree
xcener: -14.583266428236 hartree
chargesum: 1.0000000
charge: -0.261540 0.198618 -0.243242 0.200722 -0.147403 -0.124557 -0.236182 0.155981 0.174441 -0.260564 0.160133 0.178290 -0.247179 0.105507 0.164751 0.190822 0.151973 0.228774 0.203497 0.223093 0.184067
charge: 0.131439 0.013458 0.172311 0.008578 0.019490 0.072941 0.077438 -0.005261 -0.004002 0.105866 -0.012991 -0.001910 0.076439 0.312136 -0.017340 -0.000678 0.009161 0.016991 0.007088 0.039165 -0.020320
qa: -0.2615 0.1986 -0.2432 0.2007 -0.1474 -0.1246 -0.2362 0.1560 0.1744 -0.2606 0.1601 0.1783 -0.2472 0.1055 0.1648 0.1908 0.1520 0.2288 0.2035 0.2231 0.1841
va: 3.8875 0.9715 3.9131 0.9651 3.8269 3.8438 3.9072 0.9870 0.9768 3.8912 0.9843 0.9757 3.8830 3.5590 0.9830 0.9721 1.0109 0.9601 0.9711 0.9617 0.9826
dispcorr: -0.011940505 hartree
energy: -311.799850614425
dipole: 0.13460 -1.04814 -0.91354 1.39094 -0.33384 1.05709 0.42216 -0.52825 -0.10609
magnitude: 1.40116 au
magnitude: 3.56147 debye
