program: Orca
programVersion: 5.0.3
elementType: C H C H C C C H H C H H C C H H H H H H H
charge: 1
multiplicity: 1
keywords: PBE0 def2-TZVP EnGrad RIJCOSX verytightscf def2/J soscf
formula: C8H13
InChI: InChI=1/C8H13/c1-2-4-6-8-7-5-3-1/h1-2,7H,3-6,8H2
21 atoms
C  -1.99973 0.656657 0.075954
H  -2.176822 0.789625 1.149028
C  -1.776259 -0.9550 -0.171945
H  -2.634828 -1.422914 0.318592
C  -0.416015 -1.352295 0.371758
C  0.667402 -1.26164 -0.412993
C  1.972108 -0.707165 0.069147
H  2.160808 -0.937577 1.12277
H  2.836899 -1.035318 -0.517111
C  1.805138 0.834445 -0.11751
H  1.839896 1.093928 -1.181518
H  2.62014 1.373606 0.373017
C  0.449934 1.365511 0.502228
C  -0.734272 1.244879 -0.332138
H  0.51779 -1.210996 -1.495325
H  -1.842668 -1.141922 -1.247337
H  0.281986 0.970285 1.50603
H  -0.643446 1.603454 -1.362534
H  -2.853884 0.989091 -0.518579
H  0.590598 2.466192 0.586044
H  -0.313465 -1.419816 1.454982
totalener: -312.04795227 hartree
nucrepener: 379.38399888 hartree
electener: -691.43195115 hartree
oneelecener: -1159.83652949 hartree
twoeener: 468.40457834 hartree
kineticenergy: 310.15341250 hartree
exchangeener: -34.167650751693 hartree
correlationener: -1.961177954579 hartree
xcener: -36.128828706272 hartree
chargesum: 1.0000000
charge: -0.209176 0.186058 -0.219509 0.181522 -0.177386 -0.115411 -0.213308 0.158205 0.167843 -0.263167 0.160689 0.175081 -0.144979 0.061194 0.142724 0.177808 0.165350 0.208730 0.186711 0.208586 0.162435
charge: -0.185450 0.174591 -0.169653 0.158737 -0.147949 -0.145730 -0.226384 0.155785 0.160015 -0.198716 0.151289 0.157251 -0.209379 0.135898 0.156951 0.157982 0.166437 0.176759 0.166237 0.211798 0.153532
qa: -0.2092 0.1861 -0.2195 0.1815 -0.1774 -0.1154 -0.2133 0.1582 0.1678 -0.2632 0.1607 0.1751 -0.1450 0.0612 0.1427 0.1778 0.1654 0.2087 0.1867 0.2086 0.1624
va: 3.9040 0.9628 3.8916 0.9640 3.9373 3.9039 3.9268 0.9708 0.9708 3.9647 0.9664 0.9622 3.8858 3.6862 0.9670 0.9658 0.9799 0.9429 0.9663 0.9523 0.9647
energy: -312.047952267944
dipole: 0.35872 -0.98609 -0.62736 1.98254 -0.66739 1.31516 0.17605 -0.30206 -0.12600
magnitude: 1.46257 au
magnitude: 3.71755 debye
