program: Orca
programVersion: 5.0.3
elementType: C H C H C C C H H C H H C C H H H H H H H
charge: 1
multiplicity: 1
keywords: PBE0 def2-TZVP EnGrad RIJCOSX verytightscf def2/J soscf
formula: C8H13
InChI: InChI=1/C8H13/c1-2-4-6-8-7-5-3-1/h1-2,7H,3-6,8H2
21 atoms
C  -1.990473 0.580972 0.092471
H  -2.167575 0.758415 1.159111
C  -1.840673 -0.962929 -0.173537
H  -2.654605 -1.500568 0.320914
C  -0.448346 -1.293938 0.344484
C  0.645798 -1.229742 -0.446631
C  1.939218 -0.693279 0.072625
H  2.098138 -0.944513 1.126462
H  2.807627 -1.036108 -0.499825
C  1.829332 0.856911 -0.095351
H  1.876717 1.117601 -1.159066
H  2.667749 1.358943 0.395831
C  0.492909 1.43115 0.511284
C  -0.670998 1.140116 -0.318167
H  0.526943 -1.277188 -1.53067
H  -1.902919 -1.159307 -1.24881
H  0.348228 1.128992 1.551464
H  -0.568029 1.405103 -1.375342
H  -2.811613 1.002959 -0.497033
H  0.622349 2.532147 0.484803
H  -0.322317 -1.314911 1.428215
totalener: -312.05882729 hartree
nucrepener: 380.60463729 hartree
electener: -692.66346458 hartree
oneelecener: -1162.24710764 hartree
twoeener: 469.58364306 hartree
kineticenergy: 310.15853539 hartree
exchangeener: -34.171265796714 hartree
correlationener: -1.963477248369 hartree
xcener: -36.134743045083 hartree
chargesum: 1.0000000
charge: -0.191711 0.172478 -0.211338 0.175403 -0.135403 -0.110319 -0.219230 0.160697 0.171816 -0.252020 0.159334 0.176486 -0.148629 0.014103 0.162412 0.166347 0.161157 0.201294 0.180518 0.203371 0.163235
charge: -0.204775 0.167031 -0.200397 0.156063 -0.096665 -0.122432 -0.224292 0.157388 0.163532 -0.201126 0.152319 0.157222 -0.220777 0.131145 0.160774 0.158804 0.162964 0.174310 0.166522 0.203155 0.159234
qa: -0.1917 0.1725 -0.2113 0.1754 -0.1354 -0.1103 -0.2192 0.1607 0.1718 -0.2520 0.1593 0.1765 -0.1486 0.0141 0.1624 0.1663 0.1612 0.2013 0.1805 0.2034 0.1632
va: 3.8974 0.9684 3.8968 0.9685 3.9467 3.9105 3.9451 0.9698 0.9698 3.9485 0.9679 0.9620 3.9075 3.7351 0.9638 0.9722 0.9759 0.9449 0.9676 0.9557 0.9637
energy: -312.058827285981
dipole: 0.48788 -0.87946 -0.39159 1.93932 -0.98419 0.95512 0.14604 -0.26897 -0.12293
magnitude: 1.03957 au
magnitude: 2.64238 debye
