program: Orca
programVersion: 5.0.3
elementType: C H C H C C C H H C H H C C H H H H H H H
charge: 1
multiplicity: 1
keywords: PBE0 def2-TZVP EnGrad D3BJ RIJCOSX verytightscf def2/J soscf
formula: C8H13
InChI: InChI=1/C8H13/c1-2-4-6-8-7-5-3-1/h1-2,7H,3-6,8H2
21 atoms
C  -1.994473 0.540228 0.117958
H  -2.170257 0.72845 1.180887
C  -1.924098 -0.987495 -0.173652
H  -2.672393 -1.56923 0.368458
C  -0.498485 -1.189205 0.296911
C  0.619555 -1.156466 -0.491149
C  1.912249 -0.664121 0.069294
H  2.025566 -0.950893 1.120178
H  2.775094 -1.041927 -0.48669
C  1.873076 0.89736 -0.051825
H  1.970783 1.178588 -1.107215
H  2.724583 1.336516 0.475039
C  0.54327 1.478854 0.499424
C  -0.580879 0.916959 -0.282132
H  0.533579 -1.308472 -1.566842
H  -2.022688 -1.188092 -1.244943
H  0.418277 1.316486 1.574441
H  -0.445647 0.990663 -1.36431
H  -2.747367 1.072922 -0.473464
H  0.562109 2.570046 0.330664
H  -0.352809 -1.14516 1.377821
totalener: -312.07858820 hartree
nucrepener: 383.88246377 hartree
electener: -695.96105197 hartree
oneelecener: -1168.70549358 hartree
twoeener: 472.74444161 hartree
kineticenergy: 310.16684889 hartree
exchangeener: -34.182157071079 hartree
correlationener: -1.970555844395 hartree
xcener: -36.152712915474 hartree
chargesum: 1.0000000
charge: -0.194251 0.164072 -0.200647 0.176607 -0.076164 -0.082488 -0.221532 0.160809 0.175545 -0.244224 0.157541 0.176562 -0.174929 -0.051835 0.187445 0.161160 0.155093 0.190782 0.177899 0.192439 0.170118
charge: -0.206165 0.159630 -0.199670 0.155551 -0.062621 -0.064542 -0.217642 0.159651 0.163924 -0.212135 0.153445 0.157174 -0.229974 0.063581 0.165611 0.158460 0.159565 0.173901 0.161528 0.190493 0.170236
qa: -0.1943 0.1641 -0.2006 0.1766 -0.0762 -0.0825 -0.2215 0.1608 0.1755 -0.2442 0.1575 0.1766 -0.1749 -0.0518 0.1874 0.1612 0.1551 0.1908 0.1779 0.1924 0.1701
va: 3.9185 0.9735 3.9079 0.9703 3.9237 3.9018 3.9559 0.9685 0.9687 3.9403 0.9694 0.9635 3.9533 3.8346 0.9545 0.9738 0.9730 0.9503 0.9689 0.9613 0.9627
dispcorr: -0.018743811 hartree
energy: -312.097332008082
dipole: 0.56118 -0.78250 -0.22133 1.86270 -1.51592 0.34678 0.17228 -0.30642 -0.13414
magnitude: 0.43271 au
magnitude: 1.09985 debye
