program: Orca
programVersion: 5.0.3
elementType: C H C H C C C H H C H H C C H H H H H H H
charge: 1
multiplicity: 1
keywords: b3lyp def2-TZVP EnGrad D3BJ RIJCOSX verytightscf def2/J soscf
formula: C8H13
InChI: InChI=1/C8H13/c1-3-7-5-2-6-8(4-1)9-7/h3,6-8H,1-2,4-5H2
21 atoms
C  -1.991489 0.666107 0.108018
H  -2.177215 0.857683 1.169354
C  -1.831927 -0.936056 -0.129131
H  -2.645607 -1.437143 0.398212
C  -0.458382 -1.337146 0.390294
C  0.684622 -1.269182 -0.370592
C  1.993751 -0.665785 0.096619
H  2.183903 -0.867242 1.155348
H  2.848597 -1.011249 -0.487549
C  1.833603 0.936029 -0.127359
H  1.925612 1.158561 -1.19518
H  2.645725 1.436381 0.403155
C  0.458114 1.326783 0.397785
C  -0.68806 1.278683 -0.360054
H  0.543449 -1.253497 -1.455015
H  -1.926389 -1.148787 -1.198705
H  0.001982 -0.000369 0.091094
H  -0.553799 1.284588 -1.445293
H  -2.850876 1.012313 -0.46897
H  0.347706 1.331269 1.485248
H  -0.346249 -1.361922 1.47723
totalener: -312.18736012 hartree
nucrepener: 382.87457729 hartree
electener: -695.06193741 hartree
oneelecener: -1166.28937577 hartree
twoeener: 471.22743836 hartree
kineticenergy: 310.50152777 hartree
exchangeener: -36.318703606117 hartree
correlationener: -2.309213202870 hartree
xcener: -38.627916808987 hartree
chargesum: 1.0000000
charge: -0.216993 0.156889 -0.231403 0.171993 -0.080632 -0.045665 -0.217860 0.156648 0.170448 -0.232567 0.158025 0.171892 -0.078436 -0.048102 0.155102 0.158295 0.199243 0.155329 0.170496 0.163697 0.163601
charge: -0.195301 0.153212 -0.194113 0.156945 -0.123045 -0.094957 -0.195451 0.153071 0.156982 -0.194294 0.152880 0.156797 -0.124931 -0.093294 0.164213 0.153000 0.319342 0.163958 0.157074 0.164099 0.163813
qa: -0.2170 0.1569 -0.2314 0.1720 -0.0806 -0.0457 -0.2179 0.1566 0.1704 -0.2326 0.1580 0.1719 -0.0784 -0.0481 0.1551 0.1583 0.1992 0.1553 0.1705 0.1637 0.1636
va: 3.8698 0.9685 3.8892 0.9673 3.7808 3.8044 3.8717 0.9685 0.9672 3.8914 0.9680 0.9674 3.7732 3.8128 0.9639 0.9680 0.9712 0.9637 0.9671 0.9632 0.9630
dispcorr: -0.037045732 hartree
energy: -312.224405854726
dipole: -0.00292 -0.00220 -0.00513 0.00124 -0.00181 -0.00056 -0.06616 0.05387 -0.01229
magnitude: 0.01333 au
magnitude: 0.03388 debye
