program: Orca
programVersion: 5.0.3
elementType: C H C H C C C H H C H H C C H H H H H H H
charge: 1
multiplicity: 1
keywords: DSD-PBEP86/2013 def2-TZVP D3BJ RIJCOSX verytightscf def2-TZVP/C def2/J soscf noTRAH
formula: C8H13
InChI: InChI=1/C8H13/c1-2-4-6-8-7-5-3-1/h1-2,7H,3-6,8H2
21 atoms
C  -1.998767 0.525524 0.118465
H  -2.178536 0.72308 1.178676
C  -1.969336 -1.00203 -0.167266
H  -2.677316 -1.597734 0.410584
C  -0.526339 -1.118052 0.277344
C  0.605474 -1.108227 -0.508868
C  1.905639 -0.645901 0.061507
H  2.001664 -0.953406 1.108222
H  2.755885 -1.045709 -0.497441
C  1.905503 0.920209 -0.02838
H  2.04572 1.219935 -1.073456
H  2.749065 1.323242 0.538101
C  0.562716 1.480067 0.486259
C  -0.534508 0.785526 -0.25628
H  0.526942 -1.293588 -1.579635
H  -2.091709 -1.218247 -1.232496
H  0.44942 1.372167 1.570025
H  -0.415347 0.853643 -1.340697
H  -2.701321 1.107428 -0.485736
H  0.5067 2.555129 0.255659
H  -0.374313 -1.068002 1.35661
totalener: -311.17450371 hartree
nucrepener: 386.18376086 hartree
electener: -697.35826457 hartree
oneelecener: -1172.62597027 hartree
twoeener: 475.26770570 hartree
kineticenergy: 310.04328745 hartree
exchangeener: -14.132420728660 hartree
correlationener: -0.948797600030 hartree
xcener: -15.081218328689 hartree
chargesum: 1.0000000
charge: -0.197655 0.163345 -0.196423 0.177824 -0.075671 -0.050995 -0.223214 0.158786 0.176930 -0.236480 0.151956 0.173033 -0.206902 -0.038259 0.204952 0.158867 0.149265 0.177811 0.174489 0.179072 0.179270
charge: -0.188655 0.152751 -0.183093 0.149412 -0.061393 -0.010441 -0.203732 0.155044 0.157346 -0.206471 0.146357 0.150681 -0.223529 0.029870 0.165927 0.151948 0.151060 0.171800 0.150306 0.171892 0.172921
qa: -0.1977 0.1633 -0.1964 0.1778 -0.0757 -0.0510 -0.2232 0.1588 0.1769 -0.2365 0.1520 0.1730 -0.2069 -0.0383 0.2050 0.1589 0.1493 0.1778 0.1745 0.1791 0.1793
va: 3.8701 0.9742 3.8725 0.9722 3.8490 3.7930 3.9053 0.9683 0.9682 3.8757 0.9714 0.9673 3.9208 3.7275 0.9455 0.9740 0.9729 0.9581 0.9710 0.9662 0.9604
total: -311.830019840 hartree
dispcorr: -0.013770690 hartree
energy: -311.843790530279
dipole: 0.55932 -0.72204 -0.16272 1.85148 -1.82080 0.03068 0.19517 -0.38561 -0.19044
magnitude: 0.25236 au
magnitude: 0.64145 debye
