program: Orca
programVersion: 5.0.3
elementType: C H C H C C C H H C H H C C H H H H H H H
charge: 1
multiplicity: 1
keywords: DSD-PBEP86 def2-TZVP D3BJ RIJCOSX verytightscf def2-TZVP/C def2/J soscf noTRAH
formula: C8H13
InChI: InChI=1/C8H13/c1-2-4-6-8-7-5-3-1/h1-2,7H,3-6,8H2
21 atoms
C  -1.990473 0.580972 0.092471
H  -2.167575 0.758415 1.159111
C  -1.840673 -0.962929 -0.173537
H  -2.654605 -1.500568 0.320914
C  -0.448346 -1.293938 0.344484
C  0.645798 -1.229742 -0.446631
C  1.939218 -0.693279 0.072625
H  2.098138 -0.944513 1.126462
H  2.807627 -1.036108 -0.499825
C  1.829332 0.856911 -0.095351
H  1.876717 1.117601 -1.159066
H  2.667749 1.358943 0.395831
C  0.492909 1.43115 0.511284
C  -0.670998 1.140116 -0.318167
H  0.526943 -1.277188 -1.53067
H  -1.902919 -1.159307 -1.24881
H  0.348228 1.128992 1.551464
H  -0.568029 1.405103 -1.375342
H  -2.811613 1.002959 -0.497033
H  0.622349 2.532147 0.484803
H  -0.322317 -1.314911 1.428215
totalener: -311.13020327 hartree
nucrepener: 380.60463729 hartree
electener: -691.73484056 hartree
oneelecener: -1161.61960195 hartree
twoeener: 469.88476138 hartree
kineticenergy: 310.01145030 hartree
exchangeener: -13.668173494360 hartree
correlationener: -0.922349458420 hartree
xcener: -14.590522952780 hartree
chargesum: 1.0000000
charge: -0.204417 0.173898 -0.209214 0.176487 -0.157069 -0.141808 -0.215737 0.155790 0.166454 -0.244795 0.150854 0.173744 -0.169192 0.093725 0.164533 0.165139 0.161718 0.211303 0.181744 0.201840 0.165003
charge: -0.194346 0.161882 -0.192151 0.150922 -0.110035 -0.129305 -0.219428 0.150445 0.153828 -0.195530 0.144617 0.150420 -0.213088 0.193712 0.154375 0.152675 0.158044 0.174754 0.160807 0.193747 0.153656
qa: -0.2044 0.1739 -0.2092 0.1765 -0.1571 -0.1418 -0.2157 0.1558 0.1665 -0.2448 0.1509 0.1737 -0.1692 0.0937 0.1645 0.1651 0.1617 0.2113 0.1817 0.2018 0.1650
va: 3.8417 0.9673 3.8551 0.9687 3.8712 3.8518 3.8943 0.9721 0.9713 3.8742 0.9708 0.9631 3.8611 3.5159 0.9639 0.9724 0.9765 0.9395 0.9680 0.9564 0.9643
total: -311.800308233 hartree
dispcorr: -0.011898294 hartree
energy: -311.812206526654
dipole: 0.48788 -1.02776 -0.53989 1.93932 -0.78672 1.15260 0.14604 -0.32198 -0.17594
magnitude: 1.28488 au
magnitude: 3.26591 debye
