program: Orca
programVersion: 5.0.3
elementType: C H C H C C C H H C H H C C H H H H H H H
charge: 1
multiplicity: 1
keywords: DSD-PBEP86/2013 def2-TZVP RIJCOSX verytightscf def2-TZVP/C def2/J soscf noTRAH
formula: C8H13
InChI: InChI=1/C8H13/c1-2-4-6-8-7-5-3-1/h1-2,7H,3-6,8H2
21 atoms
C  -1.999288 0.523304 0.11658
H  -2.180586 0.724731 1.175756
C  -1.97688 -1.004902 -0.164804
H  -2.678298 -1.600968 0.42035
C  -0.531002 -1.106559 0.275424
C  0.602314 -1.099382 -0.511677
C  1.904826 -0.642386 0.05884
H  1.999235 -0.954549 1.104325
H  2.751817 -1.045886 -0.502284
C  1.9118 0.924194 -0.023736
H  2.060897 1.228753 -1.066096
H  2.7524 1.320557 0.551754
C  0.565465 1.478707 0.484204
C  -0.526669 0.764279 -0.25245
H  0.523597 -1.289093 -1.581628
H  -2.103573 -1.226187 -1.228392
H  0.453349 1.377977 1.568876
H  -0.411535 0.836678 -1.337145
H  -2.692299 1.111554 -0.491989
H  0.497196 2.550631 0.245234
H  -0.377558 -1.057909 1.35444
totalener: -311.18428718 hartree
nucrepener: 386.56704692 hartree
electener: -697.75133410 hartree
oneelecener: -1173.36787866 hartree
twoeener: 475.61654456 hartree
kineticenergy: 310.02516960 hartree
exchangeener: -12.765428105189 hartree
correlationener: -0.949314681729 hartree
xcener: -13.714742786918 hartree
chargesum: 1.0000000
charge: -0.197396 0.164007 -0.196704 0.178623 -0.075366 -0.044591 -0.224557 0.159917 0.178305 -0.238428 0.152981 0.173553 -0.210070 -0.046974 0.207749 0.159562 0.149139 0.176170 0.174723 0.178142 0.181215
charge: -0.186571 0.152539 -0.181342 0.149236 -0.062332 -0.002334 -0.202536 0.155338 0.157408 -0.206555 0.146250 0.150584 -0.223375 0.018464 0.166753 0.151789 0.150589 0.172289 0.149431 0.170182 0.174193
qa: -0.1974 0.1640 -0.1967 0.1786 -0.0754 -0.0446 -0.2246 0.1599 0.1783 -0.2384 0.1530 0.1736 -0.2101 -0.0470 0.2077 0.1596 0.1491 0.1762 0.1747 0.1781 0.1812
va: 3.8698 0.9744 3.8742 0.9723 3.8500 3.7836 3.9047 0.9680 0.9679 3.8776 0.9714 0.9677 3.9212 3.7377 0.9440 0.9740 0.9730 0.9593 0.9711 0.9667 0.9597
total: -311.869197067 hartree
energy: -311.869197066968
dipole: 0.55725 -0.70238 -0.14513 1.84993 -1.87235 -0.02242 0.19965 -0.39585 -0.19620
magnitude: 0.24507 au
magnitude: 0.62291 debye
