program: Orca
programVersion: 5.0.3
elementType: C H C H C C C H H C H H C C H H H H H H H
charge: 1
multiplicity: 1
keywords: DSD-PBEP86/2013 def2-TZVP D3BJ RIJCOSX verytightscf def2-TZVP/C def2/J soscf noTRAH
formula: C8H13
InChI: InChI=1/C8H13/c1-2-4-6-8-7-5-3-1/h1-2,7H,3-6,8H2
21 atoms
C  -1.994473 0.540228 0.117958
H  -2.170257 0.72845 1.180887
C  -1.924098 -0.987495 -0.173652
H  -2.672393 -1.56923 0.368458
C  -0.498485 -1.189205 0.296911
C  0.619555 -1.156466 -0.491149
C  1.912249 -0.664121 0.069294
H  2.025566 -0.950893 1.120178
H  2.775094 -1.041927 -0.48669
C  1.873076 0.89736 -0.051825
H  1.970783 1.178588 -1.107215
H  2.724583 1.336516 0.475039
C  0.54327 1.478854 0.499424
C  -0.580879 0.916959 -0.282132
H  0.533579 -1.308472 -1.566842
H  -2.022688 -1.188092 -1.244943
H  0.418277 1.316486 1.574441
H  -0.445647 0.990663 -1.36431
H  -2.747367 1.072922 -0.473464
H  0.562109 2.570046 0.330664
H  -0.352809 -1.14516 1.377821
totalener: -311.16618911 hartree
nucrepener: 383.88246377 hartree
electener: -695.04865288 hartree
oneelecener: -1168.09156721 hartree
twoeener: 473.04291432 hartree
kineticenergy: 310.02662783 hartree
exchangeener: -14.127894022870 hartree
correlationener: -0.946637891623 hartree
xcener: -15.074531914492 hartree
chargesum: 1.0000000
charge: -0.205560 0.166084 -0.202063 0.177632 -0.095800 -0.098642 -0.223016 0.157190 0.173162 -0.234908 0.150593 0.173835 -0.200300 0.016987 0.192485 0.160772 0.155753 0.193841 0.178216 0.189362 0.174374
charge: -0.196398 0.154464 -0.191755 0.149907 -0.066780 -0.060533 -0.211512 0.153040 0.156001 -0.205396 0.146113 0.150557 -0.222875 0.103949 0.161272 0.152479 0.153877 0.171831 0.155385 0.180923 0.165451
qa: -0.2056 0.1661 -0.2021 0.1776 -0.0958 -0.0986 -0.2230 0.1572 0.1732 -0.2349 0.1506 0.1738 -0.2003 0.0170 0.1925 0.1608 0.1558 0.1938 0.1782 0.1894 0.1744
va: 3.8607 0.9723 3.8587 0.9714 3.8506 3.8391 3.9023 0.9700 0.9694 3.8658 0.9717 0.9653 3.9112 3.6496 0.9529 0.9742 0.9722 0.9489 0.9700 0.9626 0.9618
total: -311.820849216 hartree
dispcorr: -0.014253422 hartree
energy: -311.835102638097
dipole: 0.56118 -0.86528 -0.30410 1.86270 -1.45262 0.41008 0.17228 -0.34445 -0.17217
magnitude: 0.53878 au
magnitude: 1.36946 debye
