program: Orca
programVersion: 5.0.3
elementType: C H C H C C C H H C H H C C H H H H H H H
charge: 1
multiplicity: 1
keywords: m062x def2-TZVP EnGrad RIJCOSX verytightscf def2/J soscf
formula: C8H13
InChI: InChI=1/C8H12.H/c1-2-4-6-8-7-5-3-1;/h1-2,7-8H,3-6H2;
21 atoms
C  -1.974591 0.653054 0.124605
H  -2.125945 0.844365 1.191599
C  -1.851069 -0.94855 -0.118673
H  -2.653133 -1.441302 0.433794
C  -0.470074 -1.347941 0.372965
C  0.672691 -1.257558 -0.385085
C  1.974977 -0.654646 0.112828
H  2.129471 -0.855329 1.177619
H  2.844701 -1.012349 -0.441046
C  1.850558 0.950097 -0.115734
H  1.972913 1.172993 -1.18021
H  2.654525 1.437142 0.438956
C  0.471387 1.345627 0.38321
C  -0.67353 1.261386 -0.371484
H  0.550108 -1.263894 -1.471293
H  -1.976383 -1.162279 -1.18474
H  -0.00064 0.000508 -0.004139
H  -0.554479 1.279187 -1.458236
H  -2.845826 1.016739 -0.423184
H  0.350187 1.326719 1.471492
H  -0.346562 -1.345418 1.45838
totalener: -312.25227713 hartree
nucrepener: 382.93506206 hartree
electener: -695.18733920 hartree
oneelecener: -1166.14878890 hartree
twoeener: 470.96144970 hartree
kineticenergy: 310.36196669 hartree
xcener: -23.104874088710 hartree
chargesum: 1.0000000
charge: -0.321029 0.207436 -0.320226 0.207321 -0.094546 -0.092405 -0.321068 0.207389 0.207226 -0.320555 0.207386 0.207403 -0.093791 -0.092981 0.199161 0.207433 0.202739 0.199055 0.207188 0.198479 0.198386
charge: -0.202402 0.157028 -0.202444 0.160005 -0.114185 -0.114659 -0.202168 0.156997 0.159913 -0.202361 0.156950 0.159996 -0.114506 -0.114999 0.167741 0.156999 0.328576 0.167809 0.159938 0.168260 0.167510
qa: -0.3210 0.2074 -0.3202 0.2073 -0.0945 -0.0924 -0.3211 0.2074 0.2072 -0.3206 0.2074 0.2074 -0.0938 -0.0930 0.1992 0.2074 0.2027 0.1991 0.2072 0.1985 0.1984
va: 3.7559 0.9481 3.7556 0.9563 3.6584 3.6524 3.7562 0.9482 0.9565 3.7557 0.9482 0.9563 3.6567 3.6528 0.9493 0.9482 0.9295 0.9493 0.9565 0.9495 0.9496
energy: -312.252277131845
dipole: -0.00135 0.00179 0.00044 -0.00438 0.00339 -0.00099 0.00389 -0.00406 -0.00016
magnitude: 0.00110 au
magnitude: 0.00280 debye
