program: Orca
programVersion: 5.0.3
elementType: C H C H C C C H H C H H C C H H H H H H H
charge: 1
multiplicity: 1
keywords: m062x cc-pVTZ EnGrad RIJCOSX verytightscf cc-pVTZ/C def2/J soscf
formula: C8H13
InChI: InChI=1/C8H13/c1-2-4-6-8-7-5-3-1/h1-2,7H,3-6,8H2
21 atoms
C  -1.993364 0.544295 0.11595
H  -2.16891 0.731401 1.179259
C  -1.91285 -0.984281 -0.174262
H  -2.670836 -1.561006 0.36022
C  -0.491616 -1.205729 0.302914
C  0.622737 -1.167606 -0.486046
C  1.914544 -0.668263 0.070294
H  2.033223 -0.950217 1.121885
H  2.779304 -1.040974 -0.4865
C  1.866057 0.89177 -0.057631
H  1.954899 1.169473 -1.114767
H  2.717729 1.339591 0.461787
C  0.537641 1.475909 0.502413
C  -0.592617 0.949495 -0.288325
H  0.533474 -1.308951 -1.563041
H  -2.005721 -1.183198 -1.24649
H  0.409759 1.297265 1.574322
H  -0.457272 1.036788 -1.369719
H  -2.757275 1.063004 -0.474204
H  0.574474 2.569972 0.351234
H  -0.347793 -1.167021 1.384334
totalener: -312.30369665 hartree
nucrepener: 383.34782729 hartree
electener: -695.65152394 hartree
oneelecener: -1167.34550570 hartree
twoeener: 471.69398176 hartree
kineticenergy: 310.01882027 hartree
xcener: -23.092158379527 hartree
chargesum: 1.0000000
charge: -0.269178 0.195036 -0.277222 0.189393 -0.099759 -0.089273 -0.311449 0.189563 0.190426 -0.269913 0.180223 0.192005 -0.307549 -0.002543 0.231304 0.187851 0.201429 0.238354 0.192983 0.223281 0.215038
charge: 0.088613 0.002824 0.092473 0.000436 0.115674 0.119591 0.074358 0.001320 0.006910 0.099271 -0.005281 0.000924 0.064256 0.289723 -0.004953 0.001221 0.003043 0.008659 0.006462 0.034266 0.000212
qa: -0.2692 0.1950 -0.2772 0.1894 -0.0998 -0.0893 -0.3114 0.1896 0.1904 -0.2699 0.1802 0.1920 -0.3075 -0.0025 0.2313 0.1879 0.2014 0.2384 0.1930 0.2233 0.2150
va: 3.7194 0.9587 3.7549 0.9595 3.6425 3.6207 3.7882 0.9579 0.9603 3.7218 0.9558 0.9517 3.7549 3.4778 0.9399 0.9631 0.9526 0.9396 0.9573 0.9456 0.9511
energy: -312.303696647261
dipole: 0.55763 -0.82604 -0.26841 1.86855 -1.39768 0.47086 0.16693 -0.30671 -0.13978
magnitude: 0.55973 au
magnitude: 1.42271 debye
