program: Orca
programVersion: 5.0.3
elementType: C H C H C C C H H C H H C C H H H H H H H
charge: 1
multiplicity: 1
keywords: m062x cc-pVTZ EnGrad RIJCOSX verytightscf cc-pVTZ/C def2/J soscf
formula: C8H13
InChI: InChI=1/C8H13/c1-2-4-6-8-7-5-3-1/h1-2,7H,3-6,8H2
21 atoms
C  -1.989877 0.568099 0.099874
H  -2.166297 0.749085 1.16538
C  -1.860284 -0.969373 -0.174461
H  -2.660134 -1.518588 0.329438
C  -0.459964 -1.273075 0.333337
C  0.638794 -1.214945 -0.458033
C  1.930479 -0.686771 0.072617
H  2.077843 -0.945965 1.126291
H  2.799183 -1.037349 -0.494116
C  1.838028 0.866011 -0.085633
H  1.893797 1.130156 -1.148282
H  2.682343 1.35371 0.409874
C  0.506549 1.447677 0.511249
C  -0.649356 1.093641 -0.311965
H  0.529211 -1.292174 -1.540712
H  -1.929303 -1.166154 -1.24923
H  0.366758 1.18061 1.562028
H  -0.534625 1.303635 -1.379935
H  -2.797854 1.016853 -0.488902
H  0.616548 2.548419 0.449715
H  -0.32815 -1.274555 1.416789
totalener: -312.29121979 hartree
nucrepener: 381.20114468 hartree
electener: -693.49236447 hartree
oneelecener: -1163.11662072 hartree
twoeener: 469.62425625 hartree
kineticenergy: 310.01484333 hartree
xcener: -23.084856090129 hartree
chargesum: 1.0000000
charge: -0.279531 0.202798 -0.278645 0.190605 -0.137972 -0.129291 -0.307000 0.189163 0.189371 -0.271598 0.180330 0.192602 -0.301662 0.061682 0.219435 0.188591 0.204626 0.250611 0.195691 0.229337 0.210857
charge: 0.089090 0.007406 0.091022 0.001124 0.092612 0.076023 0.069772 0.000084 0.006239 0.106414 -0.006260 0.000983 0.069815 0.342050 -0.012078 0.001247 0.005179 0.016764 0.010123 0.042385 -0.009995
qa: -0.2795 0.2028 -0.2786 0.1906 -0.1380 -0.1293 -0.3070 0.1892 0.1894 -0.2716 0.1803 0.1926 -0.3017 0.0617 0.2194 0.1886 0.2046 0.2506 0.1957 0.2293 0.2109
va: 3.7126 0.9537 3.7634 0.9574 3.6504 3.6377 3.7823 0.9588 0.9600 3.7220 0.9558 0.9514 3.7500 3.3782 0.9454 0.9613 0.9536 0.9322 0.9588 0.9443 0.9528
energy: -312.291219788383
dipole: 0.51473 -0.91708 -0.40235 1.91691 -0.99111 0.92580 0.14818 -0.28762 -0.13944
magnitude: 1.01904 au
magnitude: 2.59019 debye
