program: Orca
programVersion: 5.0.3
elementType: C H C H C C C H H C H H C C H H H H H H H
charge: 1
multiplicity: 1
keywords: b3lyp def2-TZVP EnGrad D3BJ RIJCOSX verytightscf def2/J soscf
formula: C8H13
InChI: InChI=1/C8H13/c1-2-4-6-8-7-5-3-1/h1-2,7H,3-6,8H2
21 atoms
C  -1.999609 0.735336 0.077719
H  -2.194599 0.86623 1.145702
C  -1.751206 -0.936823 -0.14645
H  -2.618446 -1.34586 0.377106
C  -0.427402 -1.365785 0.40508
C  0.695277 -1.284459 -0.366015
C  2.007372 -0.687337 0.068179
H  2.220265 -0.878257 1.125691
H  2.858882 -1.024814 -0.527183
C  1.799046 0.891043 -0.144949
H  1.856832 1.131535 -1.211725
H  2.610898 1.423481 0.355202
C  0.423292 1.26152 0.449486
C  -0.752267 1.318819 -0.375626
H  0.530153 -1.212441 -1.445584
H  -1.846309 -1.124723 -1.217463
H  0.105008 0.273201 0.902262
H  -0.622317 1.393872 -1.459255
H  -2.871547 0.987456 -0.526297
H  0.383795 1.835378 1.387576
H  -0.346784 -1.515815 1.483568
totalener: -312.18851675 hartree
nucrepener: 380.82114330 hartree
electener: -693.00966005 hartree
oneelecener: -1162.54960248 hartree
twoeener: 469.53994243 hartree
kineticenergy: 310.50731591 hartree
exchangeener: -36.313004423527 hartree
correlationener: -2.305789644876 hartree
xcener: -38.618794068403 hartree
chargesum: 1.0000000
charge: -0.210865 0.173832 -0.251662 0.182331 -0.101676 -0.073708 -0.201633 0.150159 0.159416 -0.288353 0.157343 0.163193 -0.038465 0.039610 0.134774 0.173415 0.079437 0.182614 0.181316 0.212421 0.176501
charge: -0.172586 0.162579 -0.152048 0.163779 -0.190541 -0.089739 -0.210154 0.151327 0.151387 -0.198777 0.147094 0.154320 -0.206673 0.064634 0.154759 0.154221 0.240751 0.167596 0.161557 0.190228 0.156286
qa: -0.2109 0.1738 -0.2517 0.1823 -0.1017 -0.0737 -0.2016 0.1502 0.1594 -0.2884 0.1573 0.1632 -0.0385 0.0396 0.1348 0.1734 0.0794 0.1826 0.1813 0.2124 0.1765
va: 3.8327 0.9647 3.9026 0.9589 3.7009 3.8638 3.8346 0.9693 0.9712 3.9223 0.9633 0.9703 3.6068 3.7092 0.9670 0.9611 1.0709 0.9545 0.9646 0.9503 0.9600
dispcorr: -0.037161920 hartree
energy: -312.225678669225
dipole: 0.06172 -0.66486 -0.60314 0.75891 -0.03686 0.72205 0.36535 -0.40021 -0.03486
magnitude: 0.94146 au
magnitude: 2.39300 debye
