program: Orca
programVersion: 5.0.3
elementType: C H C H C C C H H C H H C C H H H H H H H
charge: 1
multiplicity: 1
keywords: b3lyp def2-TZVP EnGrad D3BJ RIJCOSX verytightscf def2/J soscf
formula: C8H13
InChI: InChI=1/C8H13/c1-2-4-6-8-7-5-3-1/h1-2,7H,3-6,8H2
21 atoms
C  -2.003255 0.719946 0.081453
H  -2.208405 0.87561 1.144444
C  -1.765461 -0.927415 -0.143356
H  -2.619477 -1.370913 0.373187
C  -0.430247 -1.354162 0.409795
C  0.698218 -1.284382 -0.363675
C  2.009389 -0.686922 0.071492
H  2.223102 -0.879851 1.128084
H  2.859268 -1.020539 -0.527638
C  1.802615 0.89951 -0.143466
H  1.861909 1.132933 -1.21166
H  2.617423 1.425459 0.357786
C  0.425769 1.275633 0.43438
C  -0.739211 1.318866 -0.368471
H  0.53067 -1.206957 -1.442581
H  -1.852427 -1.128192 -1.213857
H  0.06392 0.172139 0.683857
H  -0.595897 1.326173 -1.453431
H  -2.867911 0.994388 -0.523968
H  0.361388 1.659858 1.459495
H  -0.34752 -1.516113 1.48674
totalener: -312.18382349 hartree
nucrepener: 381.52874039 hartree
electener: -693.71256388 hartree
oneelecener: -1163.84455431 hartree
twoeener: 470.13199043 hartree
kineticenergy: 310.49242795 hartree
exchangeener: -36.311464320336 hartree
correlationener: -2.307005412126 hartree
xcener: -38.618469732462 hartree
chargesum: 1.0000000
charge: -0.202600 0.164575 -0.272275 0.178143 -0.058034 -0.060291 -0.197133 0.150597 0.163142 -0.297538 0.161650 0.167485 0.006825 0.011399 0.137308 0.170066 0.041750 0.171182 0.177355 0.205790 0.180604
charge: -0.182459 0.158277 -0.171134 0.161376 -0.185883 -0.077659 -0.206510 0.152135 0.153115 -0.195705 0.149442 0.154992 -0.192612 0.027695 0.157476 0.152983 0.276069 0.166741 0.160152 0.181178 0.160331
qa: -0.2026 0.1646 -0.2723 0.1781 -0.0580 -0.0603 -0.1971 0.1506 0.1631 -0.2975 0.1616 0.1675 0.0068 0.0114 0.1373 0.1701 0.0418 0.1712 0.1774 0.2058 0.1806
va: 3.8274 0.9678 3.9422 0.9627 3.6307 3.8816 3.8323 0.9699 0.9691 3.9520 0.9625 0.9701 3.5428 3.7987 0.9666 0.9623 1.0929 0.9569 0.9649 0.9536 0.9603
dispcorr: -0.037303646 hartree
energy: -312.221127136005
dipole: 0.02443 -0.40043 -0.37600 0.43529 0.04898 0.48428 0.24434 -0.27113 -0.02679
magnitude: 0.61369 au
magnitude: 1.55988 debye
