program: Orca
programVersion: 5.0.3
elementType: C H C H C C C H H C H H C C H H H H H H H
charge: 1
multiplicity: 1
keywords: DSD-PBEP86/2013 cc-pVTZ EnGrad RIJCOSX verytightscf cc-pVTZ/C def2/J soscf
formula: C8H13
InChI: InChI=1/C8H13/c1-2-4-6-8-7-5-3-1/h1-2,7H,3-6,8H2
21 atoms
C  -1.998116 0.518565 0.10349
H  -2.186623 0.741145 1.157084
C  -1.994082 -1.013781 -0.151363
H  -2.682246 -1.600507 0.457995
C  -0.541627 -1.087219 0.276721
C  0.589724 -1.075691 -0.519488
C  1.902512 -0.63288 0.045486
H  2.000067 -0.965019 1.0846
H  2.737535 -1.042175 -0.529033
C  1.928394 0.934146 -0.006728
H  2.10503 1.258945 -1.038448
H  2.757308 1.310441 0.598509
C  0.57076 1.474224 0.481802
C  -0.506538 0.720359 -0.248849
H  0.50483 -1.275442 -1.586955
H  -2.133989 -1.258303 -1.208027
H  0.455273 1.384997 1.567287
H  -0.396804 0.805291 -1.333449
H  -2.667539 1.113091 -0.523966
H  0.477033 2.539621 0.228746
H  -0.380735 -1.04138 1.354522
totalener: -311.18209148 hartree
nucrepener: 387.31926229 hartree
electener: -698.50135377 hartree
oneelecener: -1174.81122169 hartree
twoeener: 476.30986792 hartree
kineticenergy: 309.75502911 hartree
exchangeener: -12.763926458224 hartree
correlationener: -0.949725360362 hartree
xcener: -13.713651818586 hartree
chargesum: 1.0000000
charge: -0.213383 0.169493 -0.245227 0.186252 -0.045531 -0.041532 -0.254580 0.166815 0.184923 -0.252361 0.164230 0.182509 -0.238913 -0.097477 0.227207 0.170896 0.161530 0.195442 0.184019 0.193205 0.202484
charge: 0.107778 -0.000025 0.108724 -0.000629 0.120109 0.184555 0.085625 0.002873 0.007191 0.096618 -0.005961 0.000339 0.066085 0.187646 0.006434 -0.000234 -0.002932 0.004524 -0.001668 0.017019 0.015929
qa: -0.2134 0.1695 -0.2452 0.1863 -0.0455 -0.0415 -0.2546 0.1668 0.1849 -0.2524 0.1642 0.1825 -0.2389 -0.0975 0.2272 0.1709 0.1615 0.1954 0.1840 0.1932 0.2025
va: 3.8663 0.9857 3.8889 0.9765 3.7894 3.7657 3.9225 0.9824 0.9758 3.8955 0.9803 0.9729 3.8944 3.7747 0.9586 0.9849 0.9843 0.9813 0.9742 0.9681 0.9774
energy: -311.886346814357
dipole: 0.55209 -0.68418 -0.13209 1.84470 -1.93587 -0.09117 0.21434 -0.38472 -0.17038
magnitude: 0.23407 au
magnitude: 0.59496 debye
