program: Orca
programVersion: 5.0.3
elementType: C H C H C C C H H C H H C C H H H H H H H
charge: 1
multiplicity: 1
keywords: PBE0 cc-pVTZ EnGrad RIJCOSX verytightscf cc-pVTZ/C def2/J soscf
formula: C8H13
InChI: InChI=1/C8H13/c1-2-4-6-8-7-5-3-1/h1-2,7H,3-6,8H2
21 atoms
C  -2.00098 0.674135 0.074595
H  -2.177207 0.791453 1.149034
C  -1.765879 -0.959422 -0.172077
H  -2.632069 -1.406878 0.323827
C  -0.413159 -1.360143 0.374604
C  0.669761 -1.264186 -0.408394
C  1.976927 -0.707717 0.06807
H  2.168311 -0.935441 1.121862
H  2.840764 -1.036508 -0.518764
C  1.801621 0.832457 -0.119926
H  1.835863 1.092968 -1.183684
H  2.613847 1.375094 0.371283
C  0.444846 1.35477 0.500844
C  -0.742579 1.255922 -0.33448
H  0.516331 -1.202256 -1.489931
H  -1.83791 -1.141495 -1.247379
H  0.272287 0.945802 1.498316
H  -0.649083 1.615223 -1.364285
H  -2.859885 0.989736 -0.521043
H  0.579346 2.454862 0.606047
H  -0.314363 -1.429856 1.457796
totalener: -312.04220325 hartree
nucrepener: 379.24984499 hartree
electener: -691.29204824 hartree
oneelecener: -1159.53101589 hartree
twoeener: 468.23896764 hartree
kineticenergy: 309.63293458 hartree
exchangeener: -34.148338647913 hartree
correlationener: -1.960287734303 hartree
xcener: -36.108626382216 hartree
chargesum: 1.0000000
charge: -0.181275 0.169362 -0.179574 0.160648 -0.150054 -0.129056 -0.168191 0.137623 0.149628 -0.196300 0.138152 0.152224 -0.183931 0.097966 0.145721 0.157025 0.151550 0.210116 0.171408 0.186911 0.160046
charge: 0.116214 0.015233 0.134743 0.002692 0.041568 0.045481 0.070196 -0.001672 0.002973 0.113042 -0.007913 0.000338 0.082409 0.333071 -0.017130 -0.000645 0.007654 0.022143 0.008890 0.052226 -0.021514
qa: -0.1813 0.1694 -0.1796 0.1606 -0.1501 -0.1291 -0.1682 0.1376 0.1496 -0.1963 0.1382 0.1522 -0.1839 0.0980 0.1457 0.1570 0.1515 0.2101 0.1714 0.1869 0.1600
va: 3.8398 0.9853 3.8851 0.9831 3.8153 3.8384 3.8797 0.9947 0.9883 3.8656 0.9911 0.9854 3.8966 3.5374 0.9928 0.9875 0.9971 0.9694 0.9864 0.9786 0.9933
energy: -312.042203248852
dipole: 0.33360 -1.01384 -0.68024 1.97790 -0.64983 1.32807 0.19015 -0.31760 -0.12745
magnitude: 1.49758 au
magnitude: 3.80654 debye
