program: Orca
programVersion: 5.0.3
elementType: C H C H C C C H H C H H C C H H H H H H H
charge: 1
multiplicity: 1
keywords: DSD-PBEP86/2013 cc-pVTZ EnGrad RIJCOSX verytightscf cc-pVTZ/C def2/J soscf
formula: C8H13
InChI: InChI=1/C8H13/c1-2-4-6-8-7-5-3-1/h1-2,7H,3-6,8H2
21 atoms
C  -1.99269 0.51825 0.069649
H  -2.196727 0.788408 1.10905
C  -2.000089 -1.02298 -0.119069
H  -2.680108 -1.577666 0.528049
C  -0.542919 -1.085099 0.291292
C  0.571486 -1.058323 -0.529243
C  1.901142 -0.628134 0.015016
H  2.023895 -1.001549 1.037413
H  2.718463 -1.022373 -0.594112
C  1.936751 0.938966 0.023169
H  2.144529 1.301075 -0.989878
H  2.749179 1.288196 0.665581
C  0.568035 1.46863 0.491322
C  -0.491057 0.707634 -0.262846
H  0.466894 -1.272934 -1.591773
H  -2.158281 -1.315912 -1.160567
H  0.432478 1.370173 1.573775
H  -0.365556 0.802804 -1.344825
H  -2.648052 1.088987 -0.593289
H  0.469965 2.534897 0.245478
H  -0.363203 -1.028083 1.36546
totalener: -311.18277274 hartree
nucrepener: 387.54035739 hartree
electener: -698.72313013 hartree
oneelecener: -1175.25059600 hartree
twoeener: 476.52746588 hartree
kineticenergy: 309.75569239 hartree
exchangeener: -12.764507947342 hartree
correlationener: -0.949930833339 hartree
xcener: -13.714438780680 hartree
chargesum: 1.0000000
charge: -0.215458 0.171455 -0.245795 0.186481 -0.036558 -0.044212 -0.255939 0.167731 0.183281 -0.252229 0.164713 0.181390 -0.241352 -0.097154 0.226332 0.171703 0.160165 0.194819 0.183966 0.192566 0.204096
charge: 0.109594 0.000289 0.109017 -0.000345 0.126829 0.180063 0.085939 0.002883 0.006393 0.095877 -0.006117 -0.000102 0.066321 0.184973 0.006386 -0.000083 -0.003728 0.005273 -0.001999 0.015705 0.016836
qa: -0.2155 0.1715 -0.2458 0.1865 -0.0366 -0.0442 -0.2559 0.1677 0.1833 -0.2522 0.1647 0.1814 -0.2414 -0.0972 0.2263 0.1717 0.1602 0.1948 0.1840 0.1926 0.2041
va: 3.8668 0.9848 3.8896 0.9768 3.7789 3.7662 3.9224 0.9814 0.9764 3.8956 0.9801 0.9736 3.8927 3.7785 0.9590 0.9844 0.9845 0.9820 0.9744 0.9676 0.9764
energy: -311.886819877272
dipole: 0.55616 -0.71758 -0.16142 1.83094 -1.94399 -0.11305 0.23448 -0.40296 -0.16848
magnitude: 0.25927 au
magnitude: 0.65900 debye
