program: Orca
programVersion: 5.0.3
elementType: C H C H C C C H H C H H C C H H H H H H H
charge: 1
multiplicity: 1
keywords: PBE0 cc-pVTZ EnGrad RIJCOSX verytightscf cc-pVTZ/C def2/J soscf
formula: C8H13
InChI: InChI=1/C8H13/c1-2-4-6-8-7-5-3-1/h1-2,7H,3-6,8H2
21 atoms
C  -1.996975 0.518036 0.098601
H  -2.187666 0.747785 1.150253
C  -1.996188 -1.015746 -0.146621
H  -2.682987 -1.597653 0.468833
C  -0.542865 -1.086784 0.278775
C  0.586157 -1.071387 -0.521172
C  1.901934 -0.631349 0.041056
H  2.002501 -0.969803 1.077878
H  2.733866 -1.039923 -0.538396
C  1.930933 0.935625 -0.001964
H  2.113469 1.266311 -1.030737
H  2.756913 1.307351 0.610034
C  0.571037 1.47347 0.482542
C  -0.502978 0.715989 -0.250467
H  0.49846 -1.273147 -1.58798
H  -2.139135 -1.267592 -1.201136
H  0.452758 1.384056 1.56773
H  -0.392002 0.802993 -1.334772
H  -2.6631 1.110344 -0.534304
H  0.474935 2.538443 0.229253
H  -0.379216 -1.040052 1.356098
totalener: -312.08679261 hartree
nucrepener: 387.38781538 hartree
electener: -699.47460799 hartree
oneelecener: -1175.54069736 hartree
twoeener: 476.06608937 hartree
kineticenergy: 309.66902505 hartree
exchangeener: -34.180333441189 hartree
correlationener: -1.978494543130 hartree
xcener: -36.158827984320 hartree
chargesum: 1.0000000
charge: -0.152370 0.144157 -0.175301 0.156810 -0.024650 -0.022857 -0.186355 0.142000 0.156434 -0.198661 0.141387 0.152037 -0.169660 -0.090071 0.193504 0.143073 0.136399 0.165181 0.153935 0.162753 0.172256
charge: 0.108633 0.000554 0.109270 -0.000588 0.117561 0.181117 0.086528 0.003842 0.007817 0.097278 -0.005012 0.000889 0.066860 0.183641 0.005908 0.000104 -0.002180 0.005676 -0.001514 0.017717 0.015899
qa: -0.1524 0.1442 -0.1753 0.1568 -0.0247 -0.0229 -0.1864 0.1420 0.1564 -0.1987 0.1414 0.1520 -0.1697 -0.0901 0.1935 0.1431 0.1364 0.1652 0.1539 0.1628 0.1723
va: 3.8560 0.9954 3.8750 0.9878 3.7864 3.7629 3.9030 0.9921 0.9879 3.8805 0.9889 0.9859 3.8703 3.7752 0.9769 0.9957 0.9940 0.9963 0.9860 0.9812 0.9935
energy: -312.086792611470
dipole: 0.55177 -0.67188 -0.12011 1.84321 -1.91750 -0.07429 0.21798 -0.38513 -0.16715
magnitude: 0.21882 au
magnitude: 0.55621 debye
