program: Orca
programVersion: 5.0.3
elementType: C H C H C C C H H C H H C C H H H H H H H
charge: 1
multiplicity: 1
keywords: DSD-PBEP86/2013 cc-pVTZ EnGrad D3BJ RIJCOSX verytightscf cc-pVTZ/C def2/J soscf
formula: C8H13
InChI: InChI=1/C8H13/c1-3-7-5-2-6-8(4-1)9-7/h3,6-8H,1-2,4-5H2
21 atoms
C  -1.996904 0.672268 0.102554
H  -2.192785 0.863771 1.161999
C  -1.823505 -0.93062 -0.131868
H  -2.64137 -1.433736 0.386931
C  -0.453201 -1.335178 0.396384
C  0.689262 -1.272095 -0.366646
C  2.000022 -0.670989 0.0916
H  2.200267 -0.872694 1.148349
H  2.850593 -1.011541 -0.501594
C  1.826562 0.929808 -0.130732
H  1.909393 1.15166 -1.199472
H  2.641096 1.434601 0.391806
C  0.452183 1.320755 0.402351
C  -0.694014 1.285379 -0.357433
H  0.540392 -1.240623 -1.449896
H  -1.908449 -1.142648 -1.202382
H  0.003058 -0.000902 0.138685
H  -0.55427 1.283148 -1.442118
H  -2.853316 1.010742 -0.483321
H  0.345533 1.342883 1.489906
H  -0.345389 -1.382335 1.482963
totalener: -311.09233511 hartree
nucrepener: 382.84391369 hartree
electener: -693.93624881 hartree
oneelecener: -1165.57105292 hartree
twoeener: 471.63480411 hartree
kineticenergy: 309.66726867 hartree
exchangeener: -14.115109909125 hartree
correlationener: -0.949271980683 hartree
xcener: -15.064381889809 hartree
chargesum: 1.0000000
charge: -0.252995 0.173213 -0.261633 0.186449 -0.067664 -0.048282 -0.252444 0.172675 0.186055 -0.260940 0.169767 0.186275 -0.068614 -0.049194 0.183049 0.170124 0.081305 0.184637 0.186066 0.190493 0.191657
charge: 0.108116 -0.003238 0.113012 0.001209 0.130306 0.151284 0.108104 -0.003326 0.002167 0.113039 -0.004208 0.001049 0.128401 0.153086 0.003329 -0.004132 -0.011291 0.002593 0.002226 0.004513 0.003762
qa: -0.2530 0.1732 -0.2616 0.1864 -0.0677 -0.0483 -0.2524 0.1727 0.1861 -0.2609 0.1698 0.1863 -0.0686 -0.0492 0.1830 0.1701 0.0813 0.1846 0.1861 0.1905 0.1917
va: 3.8937 0.9809 3.9087 0.9739 3.7951 3.8042 3.8933 0.9813 0.9736 3.9088 0.9826 0.9740 3.7973 3.8033 0.9830 0.9823 1.1473 0.9820 0.9736 0.9820 0.9812
dispcorr: -0.014324082 hartree
energy: -311.792335142328
dipole: -0.00488 -0.00226 -0.00713 0.00282 -0.00438 -0.00156 -0.07285 0.06060 -0.01225
magnitude: 0.01426 au
magnitude: 0.03624 debye
