program: Orca
programVersion: 5.0.3
elementType: C H C H C C C H H C H H C C H H H H H H H
charge: 1
multiplicity: 1
keywords: b3lyp cc-pVTZ EnGrad D3BJ RIJCOSX verytightscf cc-pVTZ/C def2/J soscf
formula: C8H13
InChI: InChI=1/C8H13/c1-2-4-6-8-7-5-3-1/h1-2,7H,3-6,8H2
21 atoms
C  -1.99973 0.656657 0.075954
H  -2.176822 0.789625 1.149028
C  -1.776259 -0.9550 -0.171945
H  -2.634828 -1.422914 0.318592
C  -0.416015 -1.352295 0.371758
C  0.667402 -1.26164 -0.412993
C  1.972108 -0.707165 0.069147
H  2.160808 -0.937577 1.12277
H  2.836899 -1.035318 -0.517111
C  1.805138 0.834445 -0.11751
H  1.839896 1.093928 -1.181518
H  2.62014 1.373606 0.373017
C  0.449934 1.365511 0.502228
C  -0.734272 1.244879 -0.332138
H  0.51779 -1.210996 -1.495325
H  -1.842668 -1.141922 -1.247337
H  0.281986 0.970285 1.50603
H  -0.643446 1.603454 -1.362534
H  -2.853884 0.989091 -0.518579
H  0.590598 2.466192 0.586044
H  -0.313465 -1.419816 1.454982
totalener: -312.21951748 hartree
nucrepener: 379.38399888 hartree
electener: -691.60351636 hartree
oneelecener: -1159.81881575 hartree
twoeener: 468.21529939 hartree
kineticenergy: 309.96837079 hartree
exchangeener: -36.297483008134 hartree
correlationener: -2.303411582060 hartree
xcener: -38.600894590194 hartree
chargesum: 1.0000000
charge: -0.176528 0.160417 -0.180642 0.158224 -0.124785 -0.115912 -0.169021 0.131047 0.148500 -0.190253 0.131639 0.152340 -0.164969 0.096966 0.140319 0.148879 0.141840 0.209650 0.166649 0.184316 0.151323
charge: 0.114753 0.012551 0.127756 -0.000130 0.055484 0.050095 0.075394 -0.003913 0.002056 0.118226 -0.010067 -0.001735 0.085094 0.339512 -0.019685 -0.002734 0.004841 0.019483 0.007411 0.048783 -0.023177
qa: -0.1765 0.1604 -0.1806 0.1582 -0.1248 -0.1159 -0.1690 0.1310 0.1485 -0.1903 0.1316 0.1523 -0.1650 0.0970 0.1403 0.1489 0.1418 0.2096 0.1666 0.1843 0.1513
va: 3.8135 0.9848 3.8558 0.9785 3.7899 3.8077 3.8579 0.9930 0.9834 3.8315 0.9895 0.9800 3.8581 3.5010 0.9925 0.9866 0.9979 0.9668 0.9830 0.9741 0.9939
dispcorr: -0.036484918 hartree
energy: -312.256002393160
dipole: 0.35872 -0.98160 -0.62287 1.98254 -0.69150 1.29104 0.17605 -0.30117 -0.12512
magnitude: 1.43889 au
magnitude: 3.65738 debye
