program: Orca
programVersion: 5.0.3
elementType: C H C H C C C H H C H H C C H H H H H H H
charge: 1
multiplicity: 1
keywords: DSD-PBEP86 cc-pVTZ EnGrad RIJCOSX verytightscf cc-pVTZ/C def2/J soscf
formula: C8H13
InChI: InChI=1/C8H13/c1-2-4-6-8-7-5-3-1/h1-2,7H,3-6,8H2
21 atoms
C  -1.991619 0.590989 0.088068
H  -2.169156 0.765253 1.155524
C  -1.828338 -0.958676 -0.172799
H  -2.65079 -1.488194 0.316629
C  -0.441167 -1.30616 0.351028
C  0.650468 -1.237989 -0.439544
C  1.945431 -0.697082 0.072393
H  2.111469 -0.943655 1.126181
H  2.813346 -1.035306 -0.503783
C  1.82421 0.851541 -0.100849
H  1.867491 1.110725 -1.164976
H  2.658257 1.362185 0.388805
C  0.483966 1.419343 0.510301
C  -0.684413 1.166089 -0.321457
H  0.525492 -1.2655 -1.524017
H  -1.887479 -1.154435 -1.248318
H  0.335663 1.096117 1.543375
H  -0.587903 1.46199 -1.37108
H  -2.820119 0.996253 -0.502118
H  0.622373 2.520184 0.505548
H  -0.319099 -1.339679 1.434744
totalener: -311.15125551 hartree
nucrepener: 380.29593856 hartree
electener: -691.44719407 hartree
oneelecener: -1160.97520251 hartree
twoeener: 469.52800845 hartree
kineticenergy: 309.72224496 hartree
exchangeener: -12.753638431354 hartree
correlationener: -0.943360332626 hartree
xcener: -13.696998763980 hartree
chargesum: 1.0000000
charge: -0.229570 0.183344 -0.236059 0.183683 -0.142140 -0.156691 -0.239840 0.165704 0.180965 -0.248586 0.159702 0.183471 -0.236875 0.060019 0.195041 0.169364 0.174659 0.238490 0.189662 0.214550 0.191107
charge: 0.093016 0.010305 0.095748 0.000810 0.083081 0.061645 0.070052 -0.001500 0.005240 0.111778 -0.007710 -0.000013 0.073781 0.354416 -0.015054 0.000240 0.005239 0.019023 0.010174 0.044628 -0.014900
qa: -0.2296 0.1833 -0.2361 0.1837 -0.1421 -0.1567 -0.2398 0.1657 0.1810 -0.2486 0.1597 0.1835 -0.2369 0.0600 0.1950 0.1694 0.1747 0.2385 0.1897 0.2145 0.1911
va: 3.8575 0.9779 3.9097 0.9731 3.8349 3.8455 3.9080 0.9848 0.9762 3.8827 0.9824 0.9716 3.9137 3.5396 0.9735 0.9833 0.9852 0.9523 0.9754 0.9644 0.9793
energy: -311.850487004436
dipole: 0.46804 -0.94286 -0.47482 1.95280 -0.85000 1.10280 0.14647 -0.28157 -0.13510
magnitude: 1.20825 au
magnitude: 3.07114 debye
