program: Orca
programVersion: 5.0.3
elementType: C H C H C C C H H C H H C C H H H H H H H
charge: 1
multiplicity: 1
keywords: b3lyp cc-pVTZ EnGrad RIJCOSX verytightscf cc-pVTZ/C def2/J soscf
formula: C8H13
InChI: InChI=1/C8H13/c1-2-4-6-8-7-5-3-1/h1-2,7H,3-6,8H2
21 atoms
C  -2.006342 0.696513 0.088695
H  -2.217558 0.878759 1.146578
C  -1.791339 -0.920639 -0.138508
H  -2.625917 -1.408597 0.368296
C  -0.436944 -1.339212 0.410448
C  0.698936 -1.279955 -0.361726
C  2.010422 -0.684096 0.078725
H  2.224485 -0.882339 1.133567
H  2.857425 -1.01475 -0.525267
C  1.80882 0.911059 -0.138895
H  1.872525 1.13569 -1.208513
H  2.625999 1.427988 0.367371
C  0.433965 1.299085 0.416659
C  -0.71675 1.307741 -0.357984
H  0.531447 -1.202853 -1.440463
H  -1.865782 -1.130927 -1.20969
H  0.015839 0.049279 0.366578
H  -0.564058 1.276896 -1.441024
H  -2.862346 1.004668 -0.51362
H  0.343687 1.453575 1.495649
H  -0.345059 -1.475797 1.490297
totalener: -312.18189439 hartree
nucrepener: 382.47480231 hartree
electener: -694.65669670 hartree
oneelecener: -1165.54216331 hartree
twoeener: 470.88546661 hartree
kineticenergy: 309.93993217 hartree
exchangeener: -36.292839449060 hartree
correlationener: -2.308680132290 hartree
xcener: -38.601519581350 hartree
chargesum: 1.0000000
charge: -0.191101 0.146601 -0.210291 0.159000 -0.063846 -0.026021 -0.188307 0.142107 0.158165 -0.204953 0.141505 0.156869 -0.064575 -0.002255 0.152420 0.144297 0.099043 0.160466 0.161838 0.165829 0.163209
charge: 0.111550 -0.003019 0.120472 0.000421 0.102737 0.153604 0.104986 -0.004118 0.000453 0.119628 -0.006348 -0.000708 0.117261 0.185451 -0.001961 -0.006131 -0.006850 0.002609 0.001970 0.008832 -0.000836
qa: -0.1911 0.1466 -0.2103 0.1590 -0.0638 -0.0260 -0.1883 0.1421 0.1582 -0.2050 0.1415 0.1569 -0.0646 -0.0023 0.1524 0.1443 0.0990 0.1605 0.1618 0.1658 0.1632
va: 3.8369 0.9882 3.8719 0.9811 3.7642 3.7661 3.8400 0.9894 0.9801 3.8694 0.9894 0.9826 3.7616 3.7376 0.9922 0.9883 1.0940 0.9891 0.9800 0.9931 0.9925
energy: -312.181894388833
dipole: -0.00872 -0.07960 -0.08832 0.10488 0.03377 0.13865 0.02804 -0.05100 -0.02296
magnitude: 0.16599 au
magnitude: 0.42190 debye
