program: Orca
programVersion: 5.0.3
elementType: C H C H C C C H H C H H C C H H H H H H H
charge: 1
multiplicity: 1
keywords: DSD-PBEP86 cc-pVTZ EnGrad D3BJ RIJCOSX verytightscf cc-pVTZ/C def2/J soscf
formula: C8H13
InChI: InChI=1/C8H13/c1-2-4-6-8-7-5-3-1/h1-2,7H,3-6,8H2
21 atoms
C  -1.99864 0.740193 0.076555
H  -2.189522 0.862388 1.146201
C  -1.747069 -0.940491 -0.147572
H  -2.61837 -1.33836 0.377924
C  -0.42637 -1.36954 0.403275
C  0.694078 -1.284067 -0.366973
C  2.006658 -0.687466 0.067245
H  2.219205 -0.878119 1.124935
H  2.858618 -1.026202 -0.526985
C  1.797813 0.887788 -0.145122
H  1.854647 1.130854 -1.2114
H  2.608443 1.422514 0.354925
C  0.422771 1.257858 0.455117
C  -0.755925 1.317662 -0.377311
H  0.529621 -1.21325 -1.446726
H  -1.844554 -1.123685 -1.218886
H  0.118308 0.310124 0.967057
H  -0.630205 1.419229 -1.459126
H  -2.872845 0.985835 -0.526567
H  0.39291 1.896097 1.352771
H  -0.346121 -1.513078 1.48242
totalener: -311.07556570 hartree
nucrepener: 380.60832536 hartree
electener: -691.68389106 hartree
oneelecener: -1161.49126759 hartree
twoeener: 469.80737653 hartree
kineticenergy: 309.70362951 hartree
exchangeener: -13.660095909626 hartree
correlationener: -0.923348894489 hartree
xcener: -14.583444804115 hartree
chargesum: 1.0000000
charge: -0.253196 0.190978 -0.259190 0.198115 -0.144096 -0.109216 -0.240293 0.159283 0.177046 -0.265326 0.163445 0.181133 -0.224333 0.087682 0.168727 0.186079 0.148309 0.214936 0.201109 0.227868 0.190940
charge: 0.124112 0.009265 0.150489 0.008528 0.028528 0.091934 0.082603 -0.004951 -0.003391 0.109500 -0.011597 -0.001990 0.086186 0.293965 -0.014957 -0.002113 0.009163 0.013306 0.007824 0.037931 -0.014334
qa: -0.2532 0.1910 -0.2592 0.1981 -0.1441 -0.1092 -0.2403 0.1593 0.1770 -0.2653 0.1634 0.1811 -0.2243 0.0877 0.1687 0.1861 0.1483 0.2149 0.2011 0.2279 0.1909
va: 3.8866 0.9747 3.9297 0.9671 3.8250 3.8404 3.9031 0.9860 0.9752 3.9049 0.9841 0.9765 3.8478 3.6089 0.9814 0.9747 1.0408 0.9657 0.9702 0.9657 0.9807
dispcorr: -0.012025435 hartree
energy: -311.786373348668
dipole: 0.07513 -0.80757 -0.73244 0.87611 -0.02200 0.85412 0.39056 -0.44348 -0.05292
magnitude: 1.12640 au
magnitude: 2.86309 debye
