program: Orca
programVersion: 5.0.3
elementType: C H C H C C C H H C H H C C H H H H H H H
charge: 1
multiplicity: 1
keywords: b3lyp def2-TZVP EnGrad RIJCOSX verytightscf def2/J soscf
formula: C8H13
InChI: InChI=1/C8H13/c1-2-4-6-8-7-5-3-1/h1-2,7H,3-6,8H2
21 atoms
C  -1.996975 0.518036 0.098601
H  -2.187666 0.747785 1.150253
C  -1.996188 -1.015746 -0.146621
H  -2.682987 -1.597653 0.468833
C  -0.542865 -1.086784 0.278775
C  0.586157 -1.071387 -0.521172
C  1.901934 -0.631349 0.041056
H  2.002501 -0.969803 1.077878
H  2.733866 -1.039923 -0.538396
C  1.930933 0.935625 -0.001964
H  2.113469 1.266311 -1.030737
H  2.756913 1.307351 0.610034
C  0.571037 1.47347 0.482542
C  -0.502978 0.715989 -0.250467
H  0.49846 -1.273147 -1.58798
H  -2.139135 -1.267592 -1.201136
H  0.452758 1.384056 1.56773
H  -0.392002 0.802993 -1.334772
H  -2.6631 1.110344 -0.534304
H  0.474935 2.538443 0.229253
H  -0.379216 -1.040052 1.356098
totalener: -312.25584015 hartree
nucrepener: 387.38781538 hartree
electener: -699.64365554 hartree
oneelecener: -1175.60464045 hartree
twoeener: 475.96098491 hartree
kineticenergy: 310.57239737 hartree
exchangeener: -36.355758802989 hartree
correlationener: -2.310580567919 hartree
xcener: -38.666339370907 hartree
chargesum: 1.0000000
charge: -0.176180 0.153148 -0.178729 0.166590 -0.028583 -0.022685 -0.205880 0.151293 0.165391 -0.221111 0.145080 0.161021 -0.176959 -0.061803 0.195827 0.147262 0.136042 0.156710 0.163439 0.165192 0.164936
charge: -0.181643 0.154658 -0.178690 0.151732 -0.060327 -0.008165 -0.200645 0.158390 0.160988 -0.207418 0.148985 0.153440 -0.221330 -0.020304 0.167915 0.153828 0.151977 0.176234 0.151281 0.172027 0.177068
qa: -0.1762 0.1531 -0.1787 0.1666 -0.0286 -0.0227 -0.2059 0.1513 0.1654 -0.2211 0.1451 0.1610 -0.1770 -0.0618 0.1958 0.1473 0.1360 0.1567 0.1634 0.1652 0.1649
va: 3.8597 0.9739 3.8638 0.9721 3.8047 3.7355 3.8825 0.9659 0.9690 3.8695 0.9681 0.9682 3.8854 3.7503 0.9474 0.9733 0.9736 0.9642 0.9700 0.9662 0.9640
energy: -312.255840152764
dipole: 0.55177 -0.67346 -0.12169 1.84321 -1.92359 -0.08038 0.21798 -0.38646 -0.16847
magnitude: 0.22283 au
magnitude: 0.56638 debye
