program: Orca
programVersion: 5.0.3
elementType: C H C H C C C H H C H H C C H H H H H H H
charge: 1
multiplicity: 1
keywords: DSD-PBEP86 def2-TZVP RIJCOSX verytightscf def2-TZVP/C def2/J soscf noTRAH
formula: C8H13
InChI: InChI=1/C8H13/c1-2-4-6-8-7-5-3-1/h1-2,7H,3-6,8H2
21 atoms
C  -1.997926 0.759291 0.070889
H  -2.164458 0.836829 1.148079
C  -1.731325 -0.96264 -0.156072
H  -2.618362 -1.316235 0.373912
C  -0.418395 -1.385261 0.39445
C  0.687402 -1.27807 -0.375163
C  2.002441 -0.690367 0.06334
H  2.211622 -0.88548 1.120773
H  2.856399 -1.033097 -0.52671
C  1.790388 0.863746 -0.142016
H  1.835403 1.121821 -1.205643
H  2.594731 1.410501 0.356915
C  0.421701 1.256836 0.484816
C  -0.767445 1.304256 -0.376313
H  0.523296 -1.205301 -1.454993
H  -1.835898 -1.124823 -1.229258
H  0.178846 0.532003 1.269922
H  -0.657747 1.565464 -1.432495
H  -2.881311 0.988865 -0.523431
H  0.4551 2.202285 1.062891
H  -0.337896 -1.491473 1.476051
totalener: -311.12784106 hartree
nucrepener: 379.62611325 hartree
electener: -690.75395431 hartree
oneelecener: -1159.66717945 hartree
twoeener: 468.91322514 hartree
kineticenergy: 309.99302055 hartree
exchangeener: -12.753832813382 hartree
correlationener: -0.943415861403 hartree
xcener: -13.697248674784 hartree
chargesum: 1.0000000
charge: -0.273464 0.200686 -0.200076 0.194449 -0.211083 -0.110327 -0.215515 0.156126 0.166401 -0.276314 0.153779 0.169767 -0.145366 0.106135 0.141728 0.187353 0.147081 0.213964 0.196825 0.221402 0.176449
charge: -0.167539 0.168132 -0.114673 0.158531 -0.192094 -0.119021 -0.213501 0.148142 0.147398 -0.201952 0.141345 0.150181 -0.212185 0.152589 0.150974 0.152843 0.178637 0.173510 0.158032 0.192001 0.148651
qa: -0.2735 0.2007 -0.2001 0.1944 -0.2111 -0.1103 -0.2155 0.1561 0.1664 -0.2763 0.1538 0.1698 -0.1454 0.1061 0.1417 0.1874 0.1471 0.2140 0.1968 0.2214 0.1764
va: 3.8701 0.9583 3.8367 0.9566 3.8369 3.8566 3.8680 0.9718 0.9739 3.9065 0.9691 0.9691 3.7496 3.5470 0.9681 0.9589 1.0045 0.9457 0.9647 0.9415 0.9621
total: -311.811947694 hartree
energy: -311.811947693909
dipole: 0.14952 -1.06281 -0.91329 1.49943 -0.28819 1.21124 0.40836 -0.57868 -0.17033
magnitude: 1.52650 au
magnitude: 3.88005 debye
