program: Orca
programVersion: 5.0.3
elementType: C H C H C C C H H C H H C C H H H H H H H
charge: 1
multiplicity: 1
keywords: PBE0 cc-pVTZ EnGrad D3BJ RIJCOSX verytightscf cc-pVTZ/C def2/J soscf
formula: C8H13
InChI: InChI=1/C8H13/c1-2-4-6-8-7-5-3-1/h1-2,7H,3-6,8H2
21 atoms
C  -2.006375 0.699815 0.08746
H  -2.217545 0.879321 1.145779
C  -1.787328 -0.920857 -0.139262
H  -2.624482 -1.403711 0.368318
C  -0.435591 -1.340923 0.411086
C  0.699242 -1.280851 -0.361787
C  2.010609 -0.684848 0.077488
H  2.224837 -0.882277 1.132524
H  2.857958 -1.015465 -0.526119
C  1.807659 0.909266 -0.139666
H  1.870185 1.134959 -1.209166
H  2.624647 1.427527 0.365556
C  0.432316 1.295925 0.418816
C  -0.719933 1.310124 -0.359054
H  0.530952 -1.201744 -1.440308
H  -1.863073 -1.130609 -1.210307
H  0.02032 0.063287 0.405401
H  -0.567164 1.279301 -1.442172
H  -2.863282 1.003523 -0.515702
H  0.344959 1.477213 1.494075
H  -0.345556 -1.485334 1.490013
totalener: -312.01263890 hartree
nucrepener: 382.37027704 hartree
electener: -694.38291594 hartree
oneelecener: -1165.31980442 hartree
twoeener: 470.93688848 hartree
kineticenergy: 309.59348924 hartree
exchangeener: -34.142052365211 hartree
correlationener: -1.974743496054 hartree
xcener: -36.116795861265 hartree
chargesum: 1.0000000
charge: -0.189269 0.152215 -0.212910 0.159830 -0.073079 -0.035023 -0.185557 0.146538 0.158316 -0.205892 0.147031 0.157395 -0.077157 0.000179 0.156695 0.150754 0.085513 0.165328 0.163239 0.169631 0.166222
charge: 0.107982 -0.000306 0.117826 0.002682 0.094340 0.148858 0.099571 -0.001746 0.002151 0.116421 -0.004141 0.001244 0.113282 0.189810 -0.000251 -0.003821 -0.007774 0.005704 0.004133 0.013083 0.000954
qa: -0.1893 0.1522 -0.2129 0.1598 -0.0731 -0.0350 -0.1856 0.1465 0.1583 -0.2059 0.1470 0.1574 -0.0772 0.0002 0.1567 0.1508 0.0855 0.1653 0.1632 0.1696 0.1662
va: 3.8623 0.9900 3.9062 0.9859 3.7879 3.8004 3.8673 0.9918 0.9846 3.9025 0.9918 0.9876 3.7860 3.7627 0.9928 0.9901 1.1246 0.9899 0.9843 0.9945 0.9938
dispcorr: -0.019104034 hartree
energy: -312.031742933863
dipole: -0.00678 -0.10776 -0.11454 0.13710 0.04225 0.17934 0.05439 -0.07995 -0.02556
magnitude: 0.21433 au
magnitude: 0.54479 debye
