program: Orca
programVersion: 5.0.3
elementType: C H C H C C C H H C H H C C H H H H H H H
charge: 1
multiplicity: 1
keywords: DSD-PBEP86 cc-pVTZ EnGrad D3BJ RIJCOSX verytightscf cc-pVTZ/C def2/J soscf
formula: C8H13
InChI: InChI=1/C8H13/c1-2-4-6-8-7-5-3-1/h1-2,7H,3-6,8H2
21 atoms
C  -2.001344 0.727767 0.079537
H  -2.201806 0.871367 1.145006
C  -1.75799 -0.931792 -0.144885
H  -2.618778 -1.358028 0.375334
C  -0.428817 -1.359984 0.407655
C  0.696907 -1.284661 -0.364757
C  2.008421 -0.687173 0.069732
H  2.221754 -0.878894 1.126847
H  2.859162 -1.022698 -0.527471
C  1.800832 0.895471 -0.144384
H  1.859558 1.132296 -1.211893
H  2.614305 1.42458 0.356146
C  0.424322 1.268093 0.441574
C  -0.746108 1.319541 -0.372391
H  0.530591 -1.210112 -1.4440
H  -1.849172 -1.126473 -1.215559
H  0.084493 0.22092 0.797275
H  -0.609477 1.358177 -1.457354
H  -2.869716 0.990636 -0.525399
H  0.371641 1.745746 1.429278
H  -0.34739 -1.517836 1.485213
totalener: -311.06774001 hartree
nucrepener: 381.16451246 hartree
electener: -692.23225247 hartree
oneelecener: -1162.51322241 hartree
twoeener: 470.28096994 hartree
kineticenergy: 309.67915040 hartree
exchangeener: -13.658493343249 hartree
correlationener: -0.924569662033 hartree
xcener: -14.583063005282 hartree
chargesum: 1.0000000
charge: -0.249234 0.185033 -0.271623 0.194841 -0.127843 -0.092832 -0.242449 0.162992 0.179726 -0.268983 0.166017 0.182679 -0.180739 0.054868 0.172671 0.181703 0.131693 0.205223 0.197859 0.222150 0.196248
charge: 0.117307 0.005264 0.135908 0.006446 0.044666 0.111861 0.086824 -0.004182 -0.002076 0.112511 -0.009535 -0.001548 0.095914 0.265313 -0.011157 -0.003800 0.009581 0.010466 0.006733 0.032266 -0.008763
qa: -0.2492 0.1850 -0.2716 0.1948 -0.1278 -0.0928 -0.2424 0.1630 0.1797 -0.2690 0.1660 0.1827 -0.1807 0.0549 0.1727 0.1817 0.1317 0.2052 0.1979 0.2221 0.1962
va: 3.8823 0.9771 3.9380 0.9692 3.8184 3.8358 3.8966 0.9848 0.9740 3.9177 0.9836 0.9767 3.8263 3.6674 0.9801 0.9769 1.0732 0.9694 0.9705 0.9709 0.9783
dispcorr: -0.012070585 hartree
energy: -311.782117002319
dipole: 0.04235 -0.56715 -0.52479 0.59061 0.05651 0.64712 0.31273 -0.34310 -0.03037
magnitude: 0.83372 au
magnitude: 2.11916 debye
