program: Orca
programVersion: 5.0.3
elementType: C H C H C C C H H C H H C C H H H H H H H
charge: 1
multiplicity: 1
keywords: PBE0 def2-TZVP EnGrad RIJCOSX verytightscf def2/J soscf
formula: C8H13
InChI: InChI=1/C8H13/c1-2-4-6-8-7-5-3-1/h1-2,7H,3-6,8H2
21 atoms
C  -1.997114 0.754415 0.072806
H  -2.171925 0.84688 1.147729
C  -1.735646 -0.95428 -0.152379
H  -2.618408 -1.319307 0.377315
C  -0.421834 -1.380591 0.39747
C  0.689862 -1.2810 -0.371401
C  2.004123 -0.688629 0.064554
H  2.21494 -0.880635 1.122322
H  2.857322 -1.030772 -0.526582
C  1.79312 0.874029 -0.144146
H  1.843987 1.126567 -1.208657
H  2.599379 1.416535 0.355828
C  0.421889 1.253249 0.474367
C  -0.764999 1.31018 -0.379136
H  0.526249 -1.210658 -1.45141
H  -1.839077 -1.12255 -1.224889
H  0.158024 0.442276 1.174194
H  -0.651587 1.513781 -1.447665
H  -2.878153 0.985088 -0.525108
H  0.430224 2.098259 1.185317
H  -0.342029 -1.50002 1.478379
totalener: -312.02708526 hartree
nucrepener: 379.92716152 hartree
electener: -691.95424678 hartree
oneelecener: -1160.86653050 hartree
twoeener: 468.91228371 hartree
kineticenergy: 310.15516117 hartree
exchangeener: -34.163635237888 hartree
correlationener: -1.963141088220 hartree
xcener: -36.126776326108 hartree
chargesum: 1.0000000
charge: -0.243336 0.198783 -0.224586 0.197500 -0.197409 -0.082826 -0.225877 0.162301 0.167250 -0.278594 0.160962 0.172012 -0.144832 0.066258 0.139369 0.189017 0.147668 0.196751 0.196507 0.224216 0.178868
charge: -0.169169 0.172358 -0.131662 0.167382 -0.194869 -0.109989 -0.221511 0.154579 0.153693 -0.208321 0.148805 0.157408 -0.217103 0.090639 0.156583 0.158781 0.200291 0.172161 0.164646 0.200616 0.154683
qa: -0.2433 0.1988 -0.2246 0.1975 -0.1974 -0.0828 -0.2259 0.1623 0.1672 -0.2786 0.1610 0.1720 -0.1448 0.0663 0.1394 0.1890 0.1477 0.1968 0.1965 0.2242 0.1789
va: 3.9115 0.9584 3.9016 0.9550 3.8988 3.9260 3.9085 0.9689 0.9734 3.9711 0.9671 0.9680 3.7955 3.7309 0.9673 0.9589 1.0214 0.9537 0.9632 0.9443 0.9590
energy: -312.027085258902
dipole: 0.12068 -0.93673 -0.81605 1.27839 -0.28627 0.99212 0.42790 -0.50712 -0.07922
magnitude: 1.28706 au
magnitude: 3.27145 debye
