program: Orca
programVersion: 5.0.3
elementType: C H C H C C C H H C H H C C H H H H H H H
charge: 1
multiplicity: 1
keywords: PBE0 def2-TZVP EnGrad D3BJ RIJCOSX verytightscf def2/J soscf
formula: C8H13
InChI: InChI=1/C8H13/c1-2-4-6-8-7-5-3-1/h1-2,7H,3-6,8H2
21 atoms
C  -2.000738 0.730318 0.078921
H  -2.199462 0.869744 1.145226
C  -1.75565 -0.933399 -0.145394
H  -2.618636 -1.353864 0.375991
C  -0.428354 -1.361938 0.406821
C  0.696382 -1.284647 -0.365152
C  2.008077 -0.687227 0.069193
H  2.221267 -0.878634 1.126457
H  2.859091 -1.023406 -0.527376
C  1.800251 0.894048 -0.144611
H  1.858702 1.132068 -1.211881
H  2.613203 1.424268 0.355752
C  0.423937 1.265748 0.444152
C  -0.748253 1.319449 -0.373556
H  0.530491 -1.21103 -1.444513
H  -1.848183 -1.125879 -1.216163
H  0.091483 0.238387 0.833051
H  -0.613855 1.369678 -1.458239
H  -2.870311 0.989498 -0.525767
H  0.375466 1.775262 1.416772
H  -0.347237 -1.517468 1.484676
totalener: -312.01435746 hartree
nucrepener: 381.04862763 hartree
electener: -693.06298508 hartree
oneelecener: -1162.94369811 hartree
twoeener: 469.88071303 hartree
kineticenergy: 310.12825562 hartree
exchangeener: -34.159597138307 hartree
correlationener: -1.968638898253 hartree
xcener: -36.128236036560 hartree
chargesum: 1.0000000
charge: -0.221708 0.183799 -0.277496 0.193301 -0.095617 -0.100910 -0.211884 0.163526 0.171315 -0.312514 0.170455 0.176927 -0.025570 0.015491 0.144247 0.183826 0.060245 0.181918 0.191986 0.219800 0.188861
charge: -0.182960 0.164923 -0.165015 0.166359 -0.196899 -0.091385 -0.216593 0.155519 0.155280 -0.204394 0.151745 0.158029 -0.209082 0.052428 0.159121 0.157428 0.257567 0.170394 0.164454 0.191866 0.161215
qa: -0.2217 0.1838 -0.2775 0.1933 -0.0956 -0.1009 -0.2119 0.1635 0.1713 -0.3125 0.1705 0.1769 -0.0256 0.0155 0.1442 0.1838 0.0602 0.1819 0.1920 0.2198 0.1889
va: 3.8891 0.9650 3.9944 0.9580 3.7618 3.9961 3.8891 0.9700 0.9709 4.0068 0.9633 0.9685 3.6648 3.8635 0.9663 0.9610 1.1126 0.9559 0.9637 0.9511 0.9575
dispcorr: -0.019180538 hartree
energy: -312.033537995246
dipole: 0.04878 -0.58111 -0.53233 0.64586 0.01542 0.66128 0.33199 -0.36304 -0.03105
magnitude: 0.84949 au
magnitude: 2.15923 debye
