program: Orca
programVersion: 5.0.3
elementType: C H C H C C C H H C H H C C H H H H H H H
charge: 1
multiplicity: 1
keywords: m062x def2-TZVP EnGrad RIJCOSX verytightscf def2/J soscf
formula: C8H13
InChI: InChI=1/C8H13/c1-2-4-6-8-7-5-3-1/h1-2,7H,3-6,8H2
21 atoms
C  -1.999366 0.759537 0.069766
H  -2.161951 0.828418 1.148025
C  -1.72973 -0.968504 -0.159322
H  -2.618448 -1.319428 0.369382
C  -0.415584 -1.387202 0.392263
C  0.685547 -1.275468 -0.378849
C  2.000817 -0.692747 0.062737
H  2.20832 -0.891782 1.119691
H  2.855559 -1.034645 -0.526958
C  1.788637 0.855035 -0.139386
H  1.828645 1.116513 -1.202496
H  2.592399 1.404273 0.357939
C  0.422172 1.264708 0.490723
C  -0.767738 1.299402 -0.371573
H  0.520807 -1.199802 -1.458405
H  -1.833248 -1.128188 -1.233001
H  0.193851 0.60682 1.3345
H  -0.659345 1.599145 -1.417608
H  -2.882934 0.993179 -0.522485
H  0.474789 2.267894 0.964205
H  -0.333752 -1.485087 1.4742
totalener: -312.26873742 hartree
nucrepener: 379.43143681 hartree
electener: -691.70017423 hartree
oneelecener: -1159.68418659 hartree
twoeener: 467.98401236 hartree
kineticenergy: 310.39593214 hartree
xcener: -23.089872045634 hartree
chargesum: 1.0000000
charge: -0.358529 0.238867 -0.274113 0.215869 -0.200159 -0.099785 -0.336528 0.200131 0.194894 -0.322331 0.197452 0.195652 -0.258469 0.130946 0.173227 0.221234 0.186485 0.232043 0.216568 0.245651 0.200894
charge: -0.166918 0.174366 -0.117351 0.164003 -0.188509 -0.121940 -0.224732 0.154626 0.153888 -0.209764 0.148899 0.156507 -0.215091 0.106053 0.156299 0.158005 0.176149 0.175155 0.163009 0.204046 0.153302
qa: -0.3585 0.2389 -0.2741 0.2159 -0.2002 -0.0998 -0.3365 0.2001 0.1949 -0.3223 0.1975 0.1957 -0.2585 0.1309 0.1732 0.2212 0.1865 0.2320 0.2166 0.2457 0.2009
va: 3.7712 0.9337 3.6991 0.9474 3.6541 3.6579 3.7467 0.9485 0.9627 3.7326 0.9477 0.9578 3.6848 3.4184 0.9553 0.9393 0.9685 0.9385 0.9571 0.9307 0.9513
energy: -312.268737417620
dipole: 0.17293 -1.05796 -0.88503 1.64566 -0.50783 1.13783 0.38114 -0.51153 -0.13039
magnitude: 1.44739 au
magnitude: 3.67896 debye
