program: Orca
programVersion: 5.0.3
elementType: C H C H C C C H H C H H C C H H H H H H H
charge: 1
multiplicity: 1
keywords: DSD-PBEP86/2013 def2-TZVP D3BJ RIJCOSX verytightscf def2-TZVP/C def2/J soscf noTRAH
formula: C8H13
InChI: InChI=1/C8H13/c1-2-4-6-8-7-5-3-1/h1-2,7H,3-6,8H2
21 atoms
C  -2.000738 0.730318 0.078921
H  -2.199462 0.869744 1.145226
C  -1.75565 -0.933399 -0.145394
H  -2.618636 -1.353864 0.375991
C  -0.428354 -1.361938 0.406821
C  0.696382 -1.284647 -0.365152
C  2.008077 -0.687227 0.069193
H  2.221267 -0.878634 1.126457
H  2.859091 -1.023406 -0.527376
C  1.800251 0.894048 -0.144611
H  1.858702 1.132068 -1.211881
H  2.613203 1.424268 0.355752
C  0.423937 1.265748 0.444152
C  -0.748253 1.319449 -0.373556
H  0.530491 -1.21103 -1.444513
H  -1.848183 -1.125879 -1.216163
H  0.091483 0.238387 0.833051
H  -0.613855 1.369678 -1.458239
H  -2.870311 0.989498 -0.525767
H  0.375466 1.775262 1.416772
H  -0.347237 -1.517468 1.484676
totalener: -311.09176252 hartree
nucrepener: 381.04862763 hartree
electener: -692.14039014 hartree
oneelecener: -1162.33959888 hartree
twoeener: 470.19920874 hartree
kineticenergy: 309.97405260 hartree
exchangeener: -14.117677662467 hartree
correlationener: -0.946089802182 hartree
xcener: -15.063767464649 hartree
chargesum: 1.0000000
charge: -0.227338 0.182505 -0.268960 0.190897 -0.114362 -0.125030 -0.199299 0.158663 0.169223 -0.317885 0.164915 0.175035 -0.041592 0.048312 0.145773 0.179780 0.072206 0.196090 0.192069 0.229875 0.189122
charge: -0.176988 0.159922 -0.157243 0.158638 -0.202929 -0.098652 -0.207903 0.148973 0.148871 -0.198379 0.144140 0.151222 -0.211020 0.113101 0.153040 0.151490 0.253004 0.171148 0.158926 0.185955 0.154683
qa: -0.2273 0.1825 -0.2690 0.1909 -0.1144 -0.1250 -0.1993 0.1587 0.1692 -0.3179 0.1649 0.1750 -0.0416 0.0483 0.1458 0.1798 0.0722 0.1961 0.1921 0.2299 0.1891
va: 3.8334 0.9671 3.9409 0.9587 3.6897 3.9289 3.8377 0.9720 0.9718 3.9541 0.9645 0.9705 3.5718 3.7102 0.9666 0.9625 1.1005 0.9496 0.9640 0.9467 0.9591
total: -311.754362863 hartree
dispcorr: -0.014417873 hartree
energy: -311.768780735574
dipole: 0.04878 -0.68216 -0.63338 0.64586 0.22758 0.87343 0.33199 -0.43037 -0.09838
magnitude: 1.08339 au
magnitude: 2.75376 debye
