program: Orca
programVersion: 5.0.3
elementType: C H C H C C C H H C H H C C H H H H H H H
charge: 1
multiplicity: 1
keywords: b3lyp def2-TZVP EnGrad D3BJ RIJCOSX verytightscf def2/J soscf
formula: C8H13
InChI: InChI=1/C8H13/c1-2-4-6-8-7-5-3-1/h1-2,7H,3-6,8H2
21 atoms
C  -1.997597 0.758467 0.071335
H  -2.165969 0.839453 1.148032
C  -1.732194 -0.960571 -0.155077
H  -2.618367 -1.316292 0.375022
C  -0.419301 -1.384283 0.39518
C  0.688008 -1.27887 -0.374111
C  2.002897 -0.6898 0.063608
H  2.212545 -0.883932 1.121154
H  2.856642 -1.03254 -0.526655
C  1.791057 0.866481 -0.142686
H  1.837651 1.123238 -1.206525
H  2.595788 1.412246 0.356606
C  0.421678 1.255266 0.482487
C  -0.767054 1.305825 -0.377363
H  0.524083 -1.206872 -1.454007
H  -1.836727 -1.124015 -1.228095
H  0.173868 0.508873 1.246443
H  -0.656648 1.55299 -1.436767
H  -2.88058 0.987655 -0.523847
H  0.448727 2.177833 1.094674
H  -0.339066 -1.49357 1.476637
totalener: -312.20603104 hartree
nucrepener: 379.70033381 hartree
electener: -691.90636485 hartree
oneelecener: -1160.45860794 hartree
twoeener: 468.55224308 hartree
kineticenergy: 310.53008495 hartree
exchangeener: -36.316996339324 hartree
correlationener: -2.303864927809 hartree
xcener: -38.620861267134 hartree
chargesum: 1.0000000
charge: -0.229406 0.186820 -0.207667 0.186079 -0.171726 -0.060809 -0.211568 0.147729 0.156081 -0.255607 0.147325 0.159222 -0.119562 0.079546 0.128243 0.178378 0.135832 0.196405 0.184667 0.207186 0.162835
charge: -0.160262 0.169799 -0.119384 0.163864 -0.186070 -0.107203 -0.215179 0.150623 0.150313 -0.202002 0.144791 0.153791 -0.208948 0.093936 0.152736 0.155282 0.184251 0.169940 0.161027 0.198294 0.150400
qa: -0.2294 0.1868 -0.2077 0.1861 -0.1717 -0.0608 -0.2116 0.1477 0.1561 -0.2556 0.1473 0.1592 -0.1196 0.0795 0.1282 0.1784 0.1358 0.1964 0.1847 0.2072 0.1628
va: 3.8517 0.9598 3.8250 0.9560 3.8074 3.8083 3.8528 0.9691 0.9730 3.8974 0.9673 0.9684 3.7220 3.6033 0.9685 0.9596 1.0105 0.9535 0.9652 0.9472 0.9656
dispcorr: -0.036824246 hartree
energy: -312.242855287275
dipole: 0.14222 -0.98787 -0.84565 1.44662 -0.41735 1.02927 0.41460 -0.51188 -0.09727
magnitude: 1.33566 au
magnitude: 3.39497 debye
