program: Orca
programVersion: 5.0.3
elementType: C H C H C C C H H C H H C C H H H H H H H
charge: 1
multiplicity: 1
keywords: DSD-PBEP86 cc-pVTZ EnGrad RIJCOSX verytightscf cc-pVTZ/C def2/J soscf
formula: C8H13
InChI: InChI=1/C8H13/c1-2-4-6-8-7-5-3-1/h1-2,7H,3-6,8H2
21 atoms
C  -1.991165 0.587406 0.089514
H  -2.16856 0.762873 1.156683
C  -1.832512 -0.960106 -0.173051
H  -2.652104 -1.492486 0.31796
C  -0.443579 -1.302087 0.348866
C  0.648875 -1.235297 -0.441924
C  1.943281 -0.695832 0.072492
H  2.106943 -0.943949 1.126307
H  2.811382 -1.035576 -0.502433
C  1.825917 0.853318 -0.099052
H  1.870486 1.112948 -1.163062
H  2.661488 1.361096 0.39102
C  0.487007 1.423442 0.510713
C  -0.679908 1.157611 -0.32039
H  0.525988 -1.269623 -1.526292
H  -1.89257 -1.156109 -1.248495
H  0.339982 1.107199 1.546209
H  -0.581364 1.443553 -1.372565
H  -2.817251 0.998312 -0.500424
H  0.622696 2.524347 0.498666
H  -0.320141 -1.331396 1.432603
totalener: -311.15193203 hartree
nucrepener: 380.39487109 hartree
electener: -691.54680312 hartree
oneelecener: -1161.16993377 hartree
twoeener: 469.62313065 hartree
kineticenergy: 309.72217326 hartree
exchangeener: -12.753702412610 hartree
correlationener: -0.943433894422 hartree
xcener: -13.697136307032 hartree
chargesum: 1.0000000
charge: -0.229387 0.182756 -0.235187 0.183579 -0.139716 -0.155471 -0.240355 0.165766 0.181129 -0.248581 0.159605 0.183518 -0.236717 0.056299 0.196599 0.169047 0.174647 0.237681 0.189355 0.214276 0.191158
charge: 0.092209 0.009757 0.094804 0.000721 0.085765 0.064057 0.070154 -0.001411 0.005378 0.111209 -0.007610 -0.000004 0.073172 0.352615 -0.014632 0.000298 0.005058 0.018473 0.010093 0.044076 -0.014180
qa: -0.2294 0.1828 -0.2352 0.1836 -0.1397 -0.1555 -0.2404 0.1658 0.1811 -0.2486 0.1596 0.1835 -0.2367 0.0563 0.1966 0.1690 0.1746 0.2377 0.1894 0.2143 0.1912
va: 3.8575 0.9782 3.9085 0.9733 3.8350 3.8451 3.9086 0.9848 0.9762 3.8829 0.9824 0.9716 3.9133 3.5452 0.9730 0.9836 0.9849 0.9528 0.9754 0.9644 0.9793
energy: -311.851271934886
dipole: 0.47501 -0.93704 -0.46203 1.94834 -0.87753 1.07081 0.14615 -0.28092 -0.13476
magnitude: 1.17400 au
magnitude: 2.98406 debye
