program: Orca
programVersion: 5.0.3
elementType: C H C H C C C H H C H H C C H H H H H H H
charge: 1
multiplicity: 1
keywords: b3lyp def2-TZVP EnGrad RIJCOSX verytightscf def2/J soscf
formula: C8H13
InChI: InChI=1/C8H13/c1-3-7-5-2-6-8(4-1)9-7/h3,6-8H,1-2,4-5H2
21 atoms
C  -1.999279 0.675532 0.100031
H  -2.199406 0.866803 1.158688
C  -1.819036 -0.928062 -0.133023
H  -2.639031 -1.431547 0.382011
C  -0.450508 -1.334674 0.399218
C  0.691425 -1.27334 -0.365137
C  2.002704 -0.673577 0.089319
H  2.206967 -0.875261 1.145278
H  2.851673 -1.011779 -0.507492
C  1.823125 0.926678 -0.132232
H  1.901957 1.148288 -1.201335
H  2.63864 1.433499 0.386794
C  0.449172 1.317821 0.404455
C  -0.697092 1.288716 -0.356591
H  0.538809 -1.233274 -1.44767
H  -1.899981 -1.139754 -1.203899
H  0.003682 0.000242 0.165283
H  -0.554727 1.281738 -1.440983
H  -2.854631 1.009944 -0.489672
H  0.34444 1.351536 1.491888
H  -0.344879 -1.394928 1.485326
totalener: -312.18683843 hartree
nucrepener: 382.82490050 hartree
electener: -695.01173893 hartree
oneelecener: -1166.20360132 hartree
twoeener: 471.19186239 hartree
kineticenergy: 310.50091529 hartree
exchangeener: -36.318238962084 hartree
correlationener: -2.309130860451 hartree
xcener: -38.627369822535 hartree
chargesum: 1.0000000
charge: -0.212601 0.156375 -0.237974 0.172309 -0.089017 -0.032527 -0.214153 0.155808 0.170147 -0.239803 0.158887 0.172063 -0.085413 -0.037134 0.152420 0.159402 0.192087 0.153245 0.170223 0.168160 0.167495
charge: -0.195369 0.153302 -0.193300 0.156962 -0.132567 -0.085032 -0.195888 0.153059 0.156971 -0.193724 0.152756 0.156669 -0.135905 -0.081773 0.164314 0.152968 0.317152 0.163913 0.157100 0.164514 0.163878
qa: -0.2126 0.1564 -0.2380 0.1723 -0.0890 -0.0325 -0.2142 0.1558 0.1701 -0.2398 0.1589 0.1721 -0.0854 -0.0371 0.1524 0.1594 0.1921 0.1532 0.1702 0.1682 0.1675
va: 3.8623 0.9687 3.8981 0.9674 3.7636 3.8128 3.8660 0.9687 0.9671 3.9017 0.9674 0.9676 3.7502 3.8278 0.9643 0.9674 0.9764 0.9636 0.9669 0.9625 0.9625
energy: -312.186838428158
dipole: -0.00604 -0.00428 -0.01032 0.00576 -0.00431 0.00145 -0.07067 0.05404 -0.01663
magnitude: 0.01962 au
magnitude: 0.04988 debye
