program: Orca
programVersion: 5.0.3
elementType: C H C H C C C H H C H H C C H H H H H H H
charge: 1
multiplicity: 1
keywords: DSD-PBEP86/2013 def2-TZVP D3BJ RIJCOSX verytightscf def2-TZVP/C def2/J soscf noTRAH
formula: C8H13
InChI: InChI=1/C8H13/c1-3-7-5-2-6-8(4-1)9-7/h3,6-8H,1-2,4-5H2
21 atoms
C  -2.004489 0.685971 0.093471
H  -2.213194 0.874599 1.150843
C  -1.804866 -0.922285 -0.135969
H  -2.631775 -1.422092 0.371575
C  -0.442721 -1.335355 0.406378
C  0.696532 -1.276785 -0.362389
C  2.00832 -0.680227 0.083333
H  2.220132 -0.880783 1.138033
H  2.854969 -1.012905 -0.51988
C  1.814257 0.917874 -0.136052
H  1.883617 1.139986 -1.205749
H  2.631446 1.430173 0.374879
C  0.440591 1.30871 0.41045
C  -0.706802 1.298786 -0.355983
H  0.53433 -1.213088 -1.442606
H  -1.87862 -1.133335 -1.207359
H  0.007073 0.015278 0.257548
H  -0.557545 1.276627 -1.439455
H  -2.858761 1.007545 -0.504643
H  0.342315 1.391779 1.496137
H  -0.344094 -1.437834 1.489718
totalener: -311.09412849 hartree
nucrepener: 382.71511924 hartree
electener: -693.80924772 hartree
oneelecener: -1165.37781314 hartree
twoeener: 471.56856542 hartree
kineticenergy: 309.95649188 hartree
exchangeener: -14.118250539561 hartree
correlationener: -0.949360086430 hartree
xcener: -15.067610625991 hartree
chargesum: 1.0000000
charge: -0.218309 0.165678 -0.258117 0.182799 -0.126014 -0.039030 -0.220119 0.164090 0.179604 -0.261287 0.168785 0.182089 -0.115763 -0.038594 0.160306 0.169631 0.185792 0.164875 0.180746 0.188135 0.184705
charge: -0.193459 0.151553 -0.191116 0.154011 -0.147034 -0.068468 -0.195736 0.151000 0.154001 -0.192284 0.150009 0.153480 -0.149283 -0.053386 0.163375 0.150284 0.316825 0.164260 0.154548 0.164842 0.162577
qa: -0.2183 0.1657 -0.2581 0.1828 -0.1260 -0.0390 -0.2201 0.1641 0.1796 -0.2613 0.1688 0.1821 -0.1158 -0.0386 0.1603 0.1696 0.1858 0.1649 0.1807 0.1881 0.1847
va: 3.8688 0.9712 3.9311 0.9672 3.7828 3.8712 3.8748 0.9712 0.9673 3.9349 0.9676 0.9681 3.7538 3.8836 0.9658 0.9677 1.0146 0.9637 0.9668 0.9614 0.9623
total: -311.760494048 hartree
dispcorr: -0.014307163 hartree
energy: -311.774801210718
dipole: -0.00945 -0.02733 -0.03677 0.03412 0.02280 0.05692 -0.03816 -0.00621 -0.04437
magnitude: 0.08100 au
magnitude: 0.20590 debye
