program: Orca
programVersion: 5.0.3
elementType: C H C H C C C H H C H H C C H H H H H H H
charge: 1
multiplicity: 1
keywords: DSD-PBEP86/2013 def2-TZVP RIJCOSX verytightscf def2-TZVP/C def2/J soscf noTRAH
formula: C8H13
InChI: InChI=1/C8H13/c1-2-4-6-8-7-5-3-1/h1-2,7H,3-6,8H2
21 atoms
C  -1.997597 0.758467 0.071335
H  -2.165969 0.839453 1.148032
C  -1.732194 -0.960571 -0.155077
H  -2.618367 -1.316292 0.375022
C  -0.419301 -1.384283 0.39518
C  0.688008 -1.27887 -0.374111
C  2.002897 -0.6898 0.063608
H  2.212545 -0.883932 1.121154
H  2.856642 -1.03254 -0.526655
C  1.791057 0.866481 -0.142686
H  1.837651 1.123238 -1.206525
H  2.595788 1.412246 0.356606
C  0.421678 1.255266 0.482487
C  -0.767054 1.305825 -0.377363
H  0.524083 -1.206872 -1.454007
H  -1.836727 -1.124015 -1.228095
H  0.173868 0.508873 1.246443
H  -0.656648 1.55299 -1.436767
H  -2.88058 0.987655 -0.523847
H  0.448727 2.177833 1.094674
H  -0.339066 -1.49357 1.476637
totalener: -311.12618240 hartree
nucrepener: 379.70033381 hartree
electener: -690.82651621 hartree
oneelecener: -1159.80882857 hartree
twoeener: 468.98231236 hartree
kineticenergy: 309.99275022 hartree
exchangeener: -12.753832335248 hartree
correlationener: -0.943530558495 hartree
xcener: -13.697362893743 hartree
chargesum: 1.0000000
charge: -0.271399 0.200179 -0.202148 0.194449 -0.209548 -0.111779 -0.215209 0.156363 0.166471 -0.278117 0.154065 0.169837 -0.142891 0.105391 0.141910 0.187029 0.145697 0.213240 0.196794 0.222718 0.176950
charge: -0.167764 0.167845 -0.116381 0.158705 -0.193140 -0.118872 -0.213129 0.148080 0.147323 -0.201830 0.141282 0.150193 -0.212952 0.153634 0.150905 0.152890 0.181404 0.173402 0.158220 0.191465 0.148721
qa: -0.2714 0.2002 -0.2021 0.1944 -0.2095 -0.1118 -0.2152 0.1564 0.1665 -0.2781 0.1541 0.1698 -0.1429 0.1054 0.1419 0.1870 0.1457 0.2132 0.1968 0.2227 0.1770
va: 3.8677 0.9586 3.8401 0.9565 3.8343 3.8593 3.8667 0.9717 0.9739 3.9075 0.9689 0.9694 3.7417 3.5496 0.9680 0.9591 1.0072 0.9459 0.9646 0.9409 0.9619
total: -311.810572239 hartree
energy: -311.810572239081
dipole: 0.14222 -1.05419 -0.91197 1.44662 -0.24307 1.20355 0.41460 -0.58078 -0.16618
magnitude: 1.51916 au
magnitude: 3.86139 debye
