program: Orca
programVersion: 5.0.3
elementType: C H C H C C C H H C H H C C H H H H H H H
charge: 1
multiplicity: 1
keywords: DSD-PBEP86/2013 cc-pVTZ EnGrad RIJCOSX verytightscf cc-pVTZ/C def2/J soscf
formula: C8H13
InChI: InChI=1/C8H13/c1-2-4-6-8-7-5-3-1/h1-2,7H,3-6,8H2
21 atoms
C  -2.006375 0.699815 0.08746
H  -2.217545 0.879321 1.145779
C  -1.787328 -0.920857 -0.139262
H  -2.624482 -1.403711 0.368318
C  -0.435591 -1.340923 0.411086
C  0.699242 -1.280851 -0.361787
C  2.010609 -0.684848 0.077488
H  2.224837 -0.882277 1.132524
H  2.857958 -1.015465 -0.526119
C  1.807659 0.909266 -0.139666
H  1.870185 1.134959 -1.209166
H  2.624647 1.427527 0.365556
C  0.432316 1.295925 0.418816
C  -0.719933 1.310124 -0.359054
H  0.530952 -1.201744 -1.440308
H  -1.863073 -1.130609 -1.210307
H  0.02032 0.063287 0.405401
H  -0.567164 1.279301 -1.442172
H  -2.863282 1.003523 -0.515702
H  0.344959 1.477213 1.494075
H  -0.345556 -1.485334 1.490013
totalener: -311.09498384 hartree
nucrepener: 382.37027704 hartree
electener: -693.46526089 hartree
oneelecener: -1164.70795108 hartree
twoeener: 471.24269019 hartree
kineticenergy: 309.65339325 hartree
exchangeener: -12.747725753743 hartree
correlationener: -0.948650212731 hartree
xcener: -13.696375966474 hartree
chargesum: 1.0000000
charge: -0.251326 0.177593 -0.280237 0.189434 -0.083163 -0.058681 -0.248607 0.172043 0.187062 -0.272595 0.171586 0.187386 -0.090677 -0.025232 0.181402 0.174970 0.082270 0.190991 0.191418 0.204192 0.200172
charge: 0.107102 -0.001010 0.116566 0.001989 0.096517 0.148609 0.098923 -0.002496 0.001764 0.115442 -0.004994 0.000660 0.116268 0.190280 -0.000756 -0.004767 -0.004516 0.005577 0.003754 0.013736 0.001352
qa: -0.2513 0.1776 -0.2802 0.1894 -0.0832 -0.0587 -0.2486 0.1720 0.1871 -0.2726 0.1716 0.1874 -0.0907 -0.0252 0.1814 0.1750 0.0823 0.1910 0.1914 0.2042 0.2002
va: 3.8831 0.9799 3.9337 0.9725 3.7909 3.8166 3.8872 0.9819 0.9719 3.9277 0.9819 0.9745 3.7866 3.7781 0.9808 0.9801 1.1274 0.9769 0.9714 0.9777 0.9772
energy: -311.811785585359
dipole: -0.00678 -0.10525 -0.11203 0.13710 0.04751 0.18461 0.05439 -0.07103 -0.01664
magnitude: 0.21659 au
magnitude: 0.55052 debye
