program: Orca
programVersion: 5.0.3
elementType: C H C H C C C H H C H H C C H H H H H H H
charge: 1
multiplicity: 1
keywords: PBE0 cc-pVTZ EnGrad RIJCOSX verytightscf cc-pVTZ/C def2/J soscf
formula: C8H13
InChI: InChI=1/C8H13/c1-3-7-5-2-6-8(4-1)9-7/h3,6-8H,1-2,4-5H2
21 atoms
C  -2.003122 0.682406 0.09547
H  -2.209706 0.872328 1.15306
C  -1.809653 -0.923788 -0.135045
H  -2.63415 -1.425778 0.374224
C  -0.445184 -1.334739 0.404276
C  0.695117 -1.275653 -0.363027
C  2.00688 -0.678283 0.085183
H  2.216907 -0.879402 1.140112
H  2.853904 -1.01245 -0.516651
C  1.816875 0.920645 -0.134891
H  1.888956 1.142336 -1.204477
H  2.63373 1.431207 0.378312
C  0.44331 1.311829 0.408464
C  -0.703491 1.295445 -0.355866
H  0.535719 -1.219028 -1.443987
H  -1.884868 -1.134994 -1.206364
H  0.005537 0.007984 0.224678
H  -0.556289 1.27821 -1.439636
H  -2.857386 1.00836 -0.500376
H  0.342715 1.375763 1.495092
H  -0.344154 -1.423234 1.488739
totalener: -312.01563815 hartree
nucrepener: 382.76442415 hartree
electener: -694.78006230 hartree
oneelecener: -1166.03503044 hartree
twoeener: 471.25496814 hartree
kineticenergy: 309.60238487 hartree
exchangeener: -34.145391923822 hartree
correlationener: -1.976394412751 hartree
xcener: -36.121786336573 hartree
chargesum: 1.0000000
charge: -0.191690 0.150564 -0.206004 0.158603 -0.059956 -0.027088 -0.190033 0.148922 0.159856 -0.203903 0.147905 0.158181 -0.060982 -0.023529 0.158749 0.148848 0.081422 0.161163 0.160505 0.163857 0.164610
charge: 0.107349 -0.001639 0.114507 0.002128 0.119334 0.153249 0.105995 -0.001866 0.003163 0.114534 -0.003123 0.001855 0.120155 0.160605 0.003525 -0.003057 -0.013810 0.003482 0.003408 0.006468 0.003736
qa: -0.1917 0.1506 -0.2060 0.1586 -0.0600 -0.0271 -0.1900 0.1489 0.1599 -0.2039 0.1479 0.1582 -0.0610 -0.0235 0.1587 0.1488 0.0814 0.1612 0.1605 0.1639 0.1646
va: 3.8701 0.9902 3.8947 0.9865 3.7867 3.7931 3.8705 0.9909 0.9850 3.8946 0.9913 0.9868 3.7890 3.7879 0.9943 0.9908 1.1400 0.9929 0.9850 0.9953 0.9944
energy: -312.015638151030
dipole: -0.00848 -0.01258 -0.02106 0.02045 0.00234 0.02279 -0.05341 0.03322 -0.02019
magnitude: 0.03702 au
magnitude: 0.09410 debye
