program: Orca
programVersion: 5.0.3
elementType: C H C H C C C H H C H H C C H H H H H H H
charge: 1
multiplicity: 1
keywords: PBE0 cc-pVTZ EnGrad RIJCOSX verytightscf cc-pVTZ/C def2/J soscf
formula: C8H13
InChI: InChI=1/C8H13/c1-2-4-6-8-7-5-3-1/h1-2,7H,3-6,8H2
21 atoms
C  -1.992638 0.518461 0.066236
H  -2.198588 0.793208 1.103964
C  -2.000169 -1.023444 -0.115935
H  -2.679187 -1.575199 0.534617
C  -0.542497 -1.0842 0.292665
C  0.570328 -1.057653 -0.530092
C  1.901363 -0.628065 0.011731
H  2.027185 -1.005446 1.032218
H  2.71703 -1.019818 -0.601062
C  1.936942 0.939041 0.025869
H  2.147062 1.304719 -0.985322
H  2.748016 1.285744 0.671259
C  0.567452 1.467847 0.492711
C  -0.490204 0.7071 -0.263952
H  0.463696 -1.27398 -1.592038
H  -2.159971 -1.32106 -1.155763
H  0.430154 1.368112 1.574808
H  -0.362627 0.803085 -1.345603
H  -2.646734 1.086252 -0.600313
H  0.469498 2.534359 0.248028
H  -0.360979 -1.025853 1.366424
totalener: -312.08721225 hartree
nucrepener: 387.55730452 hartree
electener: -699.64451677 hartree
oneelecener: -1175.87697800 hartree
twoeener: 476.23246123 hartree
kineticenergy: 309.67028612 hartree
exchangeener: -34.181764109795 hartree
correlationener: -1.978900200470 hartree
xcener: -36.160664310265 hartree
chargesum: 1.0000000
charge: -0.154144 0.145806 -0.176299 0.157321 -0.017066 -0.024732 -0.188500 0.143104 0.155107 -0.197900 0.141544 0.151180 -0.172052 -0.088316 0.192247 0.143450 0.135404 0.163930 0.154135 0.162025 0.173755
charge: 0.110076 0.000841 0.109318 -0.000362 0.123652 0.176934 0.086724 0.003862 0.007023 0.096664 -0.005192 0.000465 0.066926 0.182316 0.005771 0.000185 -0.002895 0.006274 -0.001784 0.016637 0.016565
qa: -0.1541 0.1458 -0.1763 0.1573 -0.0171 -0.0247 -0.1885 0.1431 0.1551 -0.1979 0.1415 0.1512 -0.1721 -0.0883 0.1922 0.1434 0.1354 0.1639 0.1541 0.1620 0.1738
va: 3.8564 0.9948 3.8769 0.9878 3.7780 3.7642 3.9034 0.9911 0.9882 3.8810 0.9887 0.9862 3.8693 3.7788 0.9773 0.9954 0.9940 0.9971 0.9861 0.9809 0.9927
energy: -312.087212251841
dipole: 0.55716 -0.70346 -0.14630 1.82918 -1.92018 -0.09100 0.23526 -0.40064 -0.16538
magnitude: 0.23882 au
magnitude: 0.60704 debye
