program: Gaussian 09
title: 000050697
version: EM64L-G09RevD.01
frameworkgroup: C1[X(C14H20N2O2)]
method: RPBEPBE
basis: SDD
operation: Freq
keyword: #p
keyword: freq=noraman
keyword: PBEPBE/SDD
title: #p freq=noraman PBEPBE/SDD
converged: YES YES NO NO
title: Mulliken charges:
elementType: O O N N C C C C C C C C C C C C C C H H H H H H H H H H H H H H H H H H H H
charge: -0.297132 -0.268942 -0.273609 -0.686002 -0.071804 -0.407866 -0.413184 -0.371985 -0.454773 -0.454820 -0.256069 0.181133 0.224269 -0.336262 -0.327980 -0.408329 -0.401532 0.499426 0.200876 0.198188 0.189040 0.196625 0.213469 0.192797 0.195227 0.220386 0.205174 0.204426 0.214798 0.234406 0.257189 0.216539 0.265368 0.264077 0.219975 0.217823 0.309189 0.309889
chargesum: 0.00000
title: Mulliken charges with hydrogens summed into heavy atoms:
elementType: O O N N C C C C C C C C C C C C C C
charge: -0.297132 -0.268942 -0.039204 -0.066924 0.129072 -0.020637 -0.003090 0.016039 -0.029213 -0.035596 0.217659 0.181133 0.224269 -0.070894 -0.063903 -0.188354 -0.183709 0.499426
polarizability: 2.70921931e+02 1.81304758e+01 1.66999273e+02 -8.86065006e+00 -4.15951384e+00 1.06230436e+02
1716.lowfreq: -15.0829 -5.0142 -0.0008 -0.0007 0.0006 9.6669 18.9063 22.1336 32.6949
frequency: 16.2895 21.6170 31.9631 61.5045 90.8849 95.1752 102.7098 152.0031 170.7018 193.4767 223.6309 236.1981 292.9981 318.4004 334.0575 364.2861 380.9900 402.3548 406.7518 415.3333 439.2153 445.4129 464.5303 506.1477 508.3303 572.6468 608.3226 634.1978 670.8187 677.7520 755.3982 778.2274 786.5458 798.0714 823.9756 826.1409 831.0214 842.9082 857.3752 888.7631 910.5863 930.7635 952.3664 972.9550 983.6922 991.7336 998.6305 1017.5672 1046.3884 1061.3596 1068.9425 1090.0793 1098.9080 1107.7509 1129.1665 1130.2130 1149.9591 1178.8156 1180.1212 1205.6928 1249.2308 1249.7467 1255.0640 1278.8365 1290.5166 1307.6350 1312.9258 1323.8545 1326.4927 1335.0003 1340.3640 1342.1104 1353.4257 1373.2680 1391.7551 1436.7785 1446.5754 1452.5076 1455.5435 1459.2929 1467.9836 1471.5052 1485.1273 1516.7044 1570.6723 1611.2916 1631.5556 1645.9299 2946.0908 2957.9253 2963.6207 2965.5411 2975.4927 2979.0291 3010.0804 3020.4511 3025.8924 3034.9418 3042.4952 3049.0832 3091.9876 3122.1516 3125.1978 3158.0426 3172.8501 3390.5898 3561.9361 3701.8930
redmass: 4.2543 3.6685 4.4101 4.4004 5.3530 4.6795 2.8597 2.7695 3.5162 4.5700 1.8938 4.6004 4.8082 1.7429 6.4037 3.2786 3.5246 1.2244 1.0589 2.7682 3.0307 3.3606 1.9875 2.9548 2.8238 2.1293 6.1820 6.8710 1.8808 3.8978 4.4163 3.3156 1.4261 1.8335 1.2666 5.2137 2.1997 1.8469 1.9594 1.7479 2.7174 3.5321 1.9857 1.3630 1.3513 1.5154 2.9926 1.4637 2.1967 4.5959 1.7806 2.0115 2.1585 3.2073 1.2327 1.6783 1.4977 1.2123 1.3764 1.6107 1.6206 1.2780 1.7138 1.2647 1.3077 1.3193 1.3503 2.9734 1.2714 1.4345 1.3897 1.3452 1.3523 1.6355 4.9227 1.1428 4.1664 1.0962 1.0864 1.0977 1.0892 1.1101 1.0824 3.2009 7.3695 10.2581 3.2441 1.4359 1.0792 1.0636 1.0594 1.0661 1.0635 1.0628 1.0610 1.0990 1.0968 1.1017 1.0985 1.1031 1.1049 1.0895 1.0891 1.0953 1.0947 1.0736 1.0450 1.1040
irintensity: 0.1857 0.4404 1.1511 1.4824 0.4021 1.6259 1.9696 0.8739 3.5006 0.9104 4.0019 5.6127 10.6903 3.1613 2.0208 0.0789 20.2308 282.8901 32.5203 0.0335 0.0300 3.8203 17.0368 2.5931 4.1569 1.1908 8.6409 2.1981 116.5393 34.7961 13.5380 5.0682 10.7630 3.0902 0.8742 1.2500 26.5932 72.1661 22.7773 12.3159 4.6095 8.0450 6.1898 0.3143 0.1641 7.1795 26.2327 9.7365 4.2191 411.8761 17.8490 31.5780 1.6254 10.4724 14.5836 14.7627 5.1758 179.8956 22.0511 6.8277 109.8344 40.3742 209.0283 36.2467 9.6573 2.2049 0.8054 117.1181 2.3946 1.7480 11.5113 8.5235 0.2158 4.2167 12.0463 25.0431 5.8755 0.4226 6.2085 14.4141 11.2610 1.4403 10.0449 68.1319 28.7339 331.3996 97.7489 324.5440 12.3762 34.8826 38.0457 32.8357 42.5640 27.8134 25.4354 41.2682 75.1993 58.9691 34.6696 72.3889 30.7766 16.8751 22.9520 9.8660 4.0360 3.0118 107.6015 22.5890
temp: 298.150 k
press: 1.00000 atm
elementType: 8 8 7 7 6 6 6 6 6 6 6 6 6 6 6 6 6 6 1 1 1 1 1 1 1 1 1 1 1 1 1 1 1 1 1 1 1 1
symmnumber: 1
zpe: 842827.8 jmol-1
zpe.correction: 0.321016 hartree
zpe.thermalcorrener: 0.338723 hartree
zpe.thermalcorrenthalpy: 0.339667 hartree
zpe.thermalcorrgfe: 0.272924 hartree
zpe.sumelectzpe: -804.085213 hartree
zpe.sumelectthermal: -804.067506 hartree
zpe.sumelectthermalent: -804.066562 hartree
zpe.sumelectthermalfe: -804.133305 hartree
dipole: -1.7861 -4.1721 0.8440
dipole: 4.6162
quadrupole: -55.9066 -109.9634 -108.8795
quadrupole: 7.5190 -2.9369 -0.7209
quadrupole: 35.6766 -18.3802 -17.2964 7.5190 -2.9369 -0.7209
hfenergy: -804.406229 hartree
pointgroup: C01 [X(C14H20N2O2)]
dipole: 0.6995441 -1.6347298 -0.3696585 debye
polarizability: 270.810641|-18.0302844|166.8334209|-9.8589514|5.5304195|106.507578 unknown
InChI: InChI=1S/C14H20N2O2/c15-12-6-4-11(5-7-12)14(17)18-10-8-13-3-1-2-9-16-13/h4-7,13,16H,1-3,8-10,15H2
charge 0 multiplicity 1
38 atoms
O  0.275168 0.032245 0.202027
O  1.060275 2.217486 0.444693
N  -3.895386 0.694357 -0.70979
N  6.547549 -1.173397 -0.463161
C  -3.531133 -0.271407 0.366834
C  -4.453394 -1.524387 0.382409
C  -5.946338 -1.113668 0.438596
C  -6.299031 -0.122346 -0.698388
C  -5.327481 1.087782 -0.676803
C  -2.042011 -0.658298 0.237888
C  -1.112065 0.548319 0.377024
C  1.296862 0.994698 0.25448
C  2.638124 0.397034 0.064069
C  3.772158 1.254137 0.076259
C  2.837571 -0.997238 -0.128692
C  5.065613 0.742608 -0.098126
C  4.127708 -1.520758 -0.302724
C  5.266546 -0.658637 -0.290827
H  -3.678037 0.266639 1.32926
H  -4.20007 -2.168045 1.248623
H  -4.261754 -2.121642 -0.534278
H  -6.152838 -0.63046 1.416542
H  -6.592608 -2.010638 0.384577
H  -6.219405 -0.637021 -1.678423
H  -7.345769 0.226627 -0.596248
H  -5.523369 1.766323 -1.527521
H  -5.49361 1.671454 0.251119
H  -1.867647 -1.140615 -0.745827
H  -1.790762 -1.408727 1.011248
H  -3.640265 0.309062 -1.633727
H  -1.318223 1.318539 -0.384621
H  -1.191962 1.022896 1.3730
H  3.609367 2.326959 0.225362
H  1.967232 -1.659547 -0.138208
H  5.930197 1.41742 -0.087094
H  4.267631 -2.598898 -0.448854
H  6.696101 -2.169284 -0.598731
H  7.359855 -0.563177 -0.454866
