program: Orca
programVersion: 5.0.3
elementType: C H C H C C C H H C H H C C H H H H H H H
charge: 1
multiplicity: 1
keywords: b3lyp cc-pVTZ EnGrad RIJCOSX verytightscf cc-pVTZ/C def2/J soscf
formula: C8H13
InChI: InChI=1/C8H13/c1-2-4-6-8-7-5-3-1/h1-2,7H,3-6,8H2
21 atoms
C  -2.000738 0.730318 0.078921
H  -2.199462 0.869744 1.145226
C  -1.75565 -0.933399 -0.145394
H  -2.618636 -1.353864 0.375991
C  -0.428354 -1.361938 0.406821
C  0.696382 -1.284647 -0.365152
C  2.008077 -0.687227 0.069193
H  2.221267 -0.878634 1.126457
H  2.859091 -1.023406 -0.527376
C  1.800251 0.894048 -0.144611
H  1.858702 1.132068 -1.211881
H  2.613203 1.424268 0.355752
C  0.423937 1.265748 0.444152
C  -0.748253 1.319449 -0.373556
H  0.530491 -1.21103 -1.444513
H  -1.848183 -1.125879 -1.216163
H  0.091483 0.238387 0.833051
H  -0.613855 1.369678 -1.458239
H  -2.870311 0.989498 -0.525767
H  0.375466 1.775262 1.416772
H  -0.347237 -1.517468 1.484676
totalener: -312.18334799 hartree
nucrepener: 381.04862763 hartree
electener: -693.23197561 hartree
oneelecener: -1162.93718547 hartree
twoeener: 469.70520986 hartree
kineticenergy: 309.95369563 hartree
exchangeener: -36.290371856484 hartree
correlationener: -2.306338257198 hartree
xcener: -38.596710113682 hartree
chargesum: 1.0000000
charge: -0.191491 0.156273 -0.209088 0.168448 -0.105383 -0.059685 -0.182560 0.133827 0.151899 -0.207586 0.137861 0.153696 -0.142734 0.076591 0.143121 0.154417 0.126743 0.177291 0.171928 0.187925 0.158508
charge: 0.121399 0.004339 0.140898 0.006063 0.044558 0.114561 0.090024 -0.005203 -0.003334 0.116125 -0.010874 -0.002481 0.095429 0.264401 -0.012791 -0.004591 0.009100 0.007311 0.005614 0.031050 -0.011597
qa: -0.1915 0.1563 -0.2091 0.1684 -0.1054 -0.0597 -0.1826 0.1338 0.1519 -0.2076 0.1379 0.1537 -0.1427 0.0766 0.1431 0.1544 0.1267 0.1773 0.1719 0.1879 0.1585
va: 3.8335 0.9856 3.8802 0.9764 3.7851 3.7895 3.8473 0.9916 0.9810 3.8631 0.9901 0.9837 3.7909 3.6233 0.9903 0.9849 1.0548 0.9811 0.9783 0.9840 0.9934
energy: -312.183347986975
dipole: 0.04878 -0.58071 -0.53194 0.64586 -0.00356 0.64230 0.33199 -0.36210 -0.03011
magnitude: 0.83451 au
magnitude: 2.12116 debye
