program: Orca
programVersion: 5.0.3
elementType: C H C H C C C H H C H H C C H H H H H H H
charge: 1
multiplicity: 1
keywords: PBE0 def2-TZVP EnGrad RIJCOSX verytightscf def2/J soscf
formula: C8H13
InChI: InChI=1/C8H13/c1-2-4-6-8-7-5-3-1/h1-2,7H,3-6,8H2
21 atoms
C  -1.992965 0.517875 0.075766
H  -2.193824 0.779757 1.117906
C  -1.999809 -1.021937 -0.124688
H  -2.681499 -1.581882 0.516136
C  -0.543508 -1.086389 0.288776
C  0.573752 -1.059823 -0.527722
C  1.900858 -0.628323 0.020647
H  2.018429 -0.994657 1.046199
H  2.721031 -1.02656 -0.582071
C  1.936222 0.938664 0.018222
H  2.139529 1.294391 -0.998033
H  2.751163 1.292336 0.655027
C  0.569028 1.469915 0.48905
C  -0.49278 0.708694 -0.260575
H  0.472741 -1.27139 -1.591234
H  -2.155072 -1.306424 -1.168985
H  0.436809 1.3737 1.572122
H  -0.370839 0.80241 -1.343087
H  -2.650465 1.093627 -0.580758
H  0.470831 2.535762 0.241206
H  -0.367026 -1.031806 1.363633
totalener: -312.09121376 hartree
nucrepener: 387.51972149 hartree
electener: -699.61093524 hartree
oneelecener: -1175.84861582 hartree
twoeener: 476.23768057 hartree
kineticenergy: 310.19225354 hartree
exchangeener: -34.200430587717 hartree
correlationener: -1.979339329837 hartree
xcener: -36.179769917555 hartree
chargesum: 1.0000000
charge: -0.188490 0.163037 -0.188971 0.176400 -0.033078 -0.046943 -0.225827 0.163348 0.176769 -0.240549 0.155886 0.173030 -0.198499 -0.091643 0.205066 0.157652 0.145853 0.169809 0.174114 0.177339 0.175698
charge: -0.187256 0.158696 -0.185138 0.155192 -0.059376 -0.016477 -0.207713 0.162529 0.163981 -0.215317 0.152833 0.156623 -0.228923 -0.025559 0.170967 0.157691 0.155545 0.181366 0.154515 0.174791 0.181028
qa: -0.1885 0.1630 -0.1890 0.1764 -0.0331 -0.0469 -0.2258 0.1633 0.1768 -0.2405 0.1559 0.1730 -0.1985 -0.0916 0.2051 0.1577 0.1459 0.1698 0.1741 0.1773 0.1757
va: 3.9321 0.9752 3.9397 0.9708 3.9133 3.8466 3.9640 0.9656 0.9679 3.9590 0.9697 0.9671 3.9679 3.9164 0.9428 0.9738 0.9738 0.9626 0.9691 0.9660 0.9608
energy: -312.091213756612
dipole: 0.55460 -0.69764 -0.14305 1.83397 -1.92137 -0.08740 0.23233 -0.39830 -0.16597
magnitude: 0.23589 au
magnitude: 0.59959 debye
