program: Orca
programVersion: 5.0.3
elementType: C H C H C C C H H C H H C C H H H H H H H
charge: 1
multiplicity: 1
keywords: b3lyp def2-TZVP EnGrad RIJCOSX verytightscf def2/J soscf
formula: C8H13
InChI: InChI=1/C8H13/c1-2-4-6-8-7-5-3-1/h1-2,7H,3-6,8H2
21 atoms
C  -1.992638 0.518461 0.066236
H  -2.198588 0.793208 1.103964
C  -2.000169 -1.023444 -0.115935
H  -2.679187 -1.575199 0.534617
C  -0.542497 -1.0842 0.292665
C  0.570328 -1.057653 -0.530092
C  1.901363 -0.628065 0.011731
H  2.027185 -1.005446 1.032218
H  2.71703 -1.019818 -0.601062
C  1.936942 0.939041 0.025869
H  2.147062 1.304719 -0.985322
H  2.748016 1.285744 0.671259
C  0.567452 1.467847 0.492711
C  -0.490204 0.7071 -0.263952
H  0.463696 -1.27398 -1.592038
H  -2.159971 -1.32106 -1.155763
H  0.430154 1.368112 1.574808
H  -0.362627 0.803085 -1.345603
H  -2.646734 1.086252 -0.600313
H  0.469498 2.534359 0.248028
H  -0.360979 -1.025853 1.366424
totalener: -312.25600808 hartree
nucrepener: 387.55730452 hartree
electener: -699.81331260 hartree
oneelecener: -1175.94090110 hartree
twoeener: 476.12758851 hartree
kineticenergy: 310.57445375 hartree
exchangeener: -36.357302807670 hartree
correlationener: -2.310746819697 hartree
xcener: -38.668049627367 hartree
chargesum: 1.0000000
charge: -0.179129 0.153718 -0.179052 0.166009 -0.020608 -0.027531 -0.208611 0.152275 0.163840 -0.221775 0.145162 0.159920 -0.182531 -0.052391 0.197043 0.148012 0.135238 0.156111 0.163068 0.164679 0.166551
charge: -0.180232 0.155027 -0.178567 0.151925 -0.053789 -0.012696 -0.200718 0.158699 0.160203 -0.208282 0.148904 0.153079 -0.221353 -0.022265 0.167959 0.153938 0.151415 0.177581 0.151032 0.170850 0.177289
qa: -0.1791 0.1537 -0.1791 0.1660 -0.0206 -0.0275 -0.2086 0.1523 0.1638 -0.2218 0.1452 0.1599 -0.1825 -0.0524 0.1970 0.1480 0.1352 0.1561 0.1631 0.1647 0.1666
va: 3.8622 0.9734 3.8676 0.9723 3.7960 3.7294 3.8820 0.9649 0.9694 3.8733 0.9678 0.9689 3.8852 3.7467 0.9460 0.9729 0.9732 0.9642 0.9698 0.9662 0.9628
energy: -312.256008078585
dipole: 0.55716 -0.70497 -0.14781 1.82918 -1.92655 -0.09737 0.23526 -0.40208 -0.16682
magnitude: 0.24323 au
magnitude: 0.61823 debye
