program: Orca
programVersion: 5.0.3
elementType: C H C H C C C H H C H H C C H H H H H H H
charge: 1
multiplicity: 1
keywords: PBE0 cc-pVTZ EnGrad D3BJ RIJCOSX verytightscf cc-pVTZ/C def2/J soscf
formula: C8H13
InChI: InChI=1/C8H13/c1-2-4-6-8-7-5-3-1/h1-2,7H,3-6,8H2
21 atoms
C  -1.998239 0.742476 0.075993
H  -2.187013 0.860334 1.146445
C  -1.745249 -0.942351 -0.148196
H  -2.6183 -1.33511 0.378062
C  -0.425845 -1.371154 0.402488
C  0.693614 -1.283771 -0.367554
C  2.006299 -0.687593 0.066811
H  2.218622 -0.878211 1.124557
H  2.85841 -1.026885 -0.526961
C  1.797075 0.886094 -0.145139
H  1.853523 1.130428 -1.211132
H  2.607235 1.421703 0.35499
C  0.422645 1.25692 0.457491
C  -0.757428 1.316809 -0.377942
H  0.529296 -1.213337 -1.447347
H  -1.843742 -1.123284 -1.219671
H  0.12287 0.321443 1.003508
H  -0.633967 1.432567 -1.458558
H  -2.873592 0.985213 -0.526488
H  0.397966 1.926235 1.332589
H  -0.34575 -1.511993 1.481843
totalener: -312.01494538 hartree
nucrepener: 380.47693999 hartree
electener: -692.49188537 hartree
oneelecener: -1161.85475351 hartree
twoeener: 469.36286814 hartree
kineticenergy: 309.61658184 hartree
exchangeener: -34.141267983112 hartree
correlationener: -1.965298781973 hartree
xcener: -36.106566765085 hartree
chargesum: 1.0000000
charge: -0.198117 0.167288 -0.195747 0.171684 -0.137599 -0.078705 -0.179390 0.135870 0.149691 -0.201911 0.140355 0.153303 -0.190173 0.103300 0.144024 0.163326 0.137317 0.185381 0.175933 0.194490 0.159678
charge: 0.122759 0.010019 0.149995 0.009302 0.026961 0.094700 0.081706 -0.003326 -0.002407 0.109281 -0.010112 -0.000510 0.083489 0.283005 -0.012978 -0.001136 0.015387 0.011658 0.007953 0.038485 -0.014231
qa: -0.1981 0.1673 -0.1957 0.1717 -0.1376 -0.0787 -0.1794 0.1359 0.1497 -0.2019 0.1404 0.1533 -0.1902 0.1033 0.1440 0.1633 0.1373 0.1854 0.1759 0.1945 0.1597
va: 3.8656 0.9846 3.9019 0.9796 3.8194 3.8221 3.8835 0.9946 0.9865 3.8815 0.9933 0.9878 3.8467 3.6108 0.9928 0.9849 1.0477 0.9816 0.9818 0.9825 0.9956
dispcorr: -0.019119252 hartree
energy: -312.034064630830
dipole: 0.08020 -0.77069 -0.69049 0.92736 -0.09750 0.82986 0.40488 -0.45083 -0.04595
magnitude: 1.08054 au
magnitude: 2.74651 debye
