program: Orca
programVersion: 5.0.3
charge: 1
multiplicity: 1
keywords: DLPNO-CCSD(T1) tightPNO Extrapolate(3/4,def2) RIJK def2/JK verytightSCF miniprint nopop
formula: C8H13
InChI: InChI=1/C8H13/c1-2-4-6-8-7-5-3-1/h1-2,7H,3-6,8H2
21 atoms
C  -1.990473 0.580972 0.092471
H  -2.167575 0.758415 1.159111
C  -1.840673 -0.962929 -0.173537
H  -2.654605 -1.500568 0.320914
C  -0.448346 -1.293938 0.344484
C  0.645798 -1.229742 -0.446631
C  1.939218 -0.693279 0.072625
H  2.098138 -0.944513 1.126462
H  2.807627 -1.036108 -0.499825
C  1.829332 0.856911 -0.095351
H  1.876717 1.117601 -1.159066
H  2.667749 1.358943 0.395831
C  0.492909 1.43115 0.511284
C  -0.670998 1.140116 -0.318167
H  0.526943 -1.277188 -1.53067
H  -1.902919 -1.159307 -1.24881
H  0.348228 1.128992 1.551464
H  -0.568029 1.405103 -1.375342
H  -2.811613 1.002959 -0.497033
H  0.622349 2.532147 0.484803
H  -0.322317 -1.314911 1.428215
e0: -310.304807831 hartree
corrType: DLPNO BASED
e0: -310.318506193 hartree
basis: def2-TZVPP def2-QZVPP
scfener: -310.304807831 -310.318506194
corrmethod: MDCI MDCI
correner: -1.445454215 -1.515944557
corrcbsextra: -1.568159587
energy: -311.888552574465
dipole: 0.48788 -1.09211 -0.60423 1.93932 -0.70760 1.23171 0.14604 -0.34914 -0.20310
magnitude: 1.38689 au
magnitude: 3.52520 debye
