program: Orca
programVersion: 5.0.3
elementType: C H C H C C C H H C H H C C H H H H H H H
charge: 1
multiplicity: 1
keywords: DSD-PBEP86 cc-pVTZ EnGrad D3BJ RIJCOSX verytightscf cc-pVTZ/C def2/J soscf
formula: C8H13
InChI: InChI=1/C8H13/c1-2-4-6-8-7-5-3-1/h1-2,7H,3-6,8H2
21 atoms
C  -1.999609 0.735336 0.077719
H  -2.194599 0.86623 1.145702
C  -1.751206 -0.936823 -0.14645
H  -2.618446 -1.34586 0.377106
C  -0.427402 -1.365785 0.40508
C  0.695277 -1.284459 -0.366015
C  2.007372 -0.687337 0.068179
H  2.220265 -0.878257 1.125691
H  2.858882 -1.024814 -0.527183
C  1.799046 0.891043 -0.144949
H  1.856832 1.131535 -1.211725
H  2.610898 1.423481 0.355202
C  0.423292 1.26152 0.449486
C  -0.752267 1.318819 -0.375626
H  0.530153 -1.212441 -1.445584
H  -1.846309 -1.124723 -1.217463
H  0.105008 0.273201 0.902262
H  -0.622317 1.393872 -1.459255
H  -2.871547 0.987456 -0.526297
H  0.383795 1.835378 1.387576
H  -0.346784 -1.515815 1.483568
totalener: -311.07192832 hartree
nucrepener: 380.82114330 hartree
electener: -691.89307162 hartree
oneelecener: -1161.88409589 hartree
twoeener: 469.99102427 hartree
kineticenergy: 309.69368008 hartree
exchangeener: -13.659397264600 hartree
correlationener: -0.923815161258 hartree
xcener: -14.583212425859 hartree
chargesum: 1.0000000
charge: -0.251558 0.188690 -0.264218 0.196948 -0.139544 -0.102813 -0.241461 0.160703 0.178037 -0.266829 0.164447 0.181752 -0.209691 0.076723 0.170192 0.184442 0.143358 0.211055 0.199901 0.226581 0.193283
charge: 0.121491 0.007743 0.144551 0.007855 0.033865 0.099353 0.084099 -0.004667 -0.002931 0.110582 -0.010843 -0.001857 0.089589 0.283748 -0.013618 -0.002767 0.010230 0.012188 0.007512 0.036091 -0.012214
qa: -0.2516 0.1887 -0.2642 0.1969 -0.1395 -0.1028 -0.2415 0.1607 0.1780 -0.2668 0.1644 0.1818 -0.2097 0.0767 0.1702 0.1844 0.1434 0.2111 0.1999 0.2266 0.1933
va: 3.8853 0.9756 3.9335 0.9679 3.8231 3.8389 3.9009 0.9855 0.9747 3.9100 0.9839 0.9766 3.8399 3.6304 0.9809 0.9755 1.0528 0.9672 0.9703 0.9675 0.9797
dispcorr: -0.012044436 hartree
energy: -311.784151545936
dipole: 0.06172 -0.71752 -0.65579 0.75891 0.01879 0.77769 0.36535 -0.40762 -0.04227
magnitude: 1.01816 au
magnitude: 2.58797 debye
